{"text_format":"1","workbook":"xlsx","n_sheets":3,"sheets":["Español","calculator","Precios"],"not_rendered":{"charts":0,"images":13,"macros":1,"external_links":1,"defined_names":7,"comments":0,"pivot_tables":0},"unopened":[],"bounds":{"document_bytes":16777216,"sheet_cells":100000,"rows_first":2000,"rows_last":500,"rows_between":2000,"halvings":0,"cell_chars":16384,"cell_head_chars":4096},"cells_cut":0,"cells_raw":0,"read":"whole","date_system":"1900"}

{"sheet":"Español","index":0,"n_rows":40,"n_cols":34,"rows_kept":40,"cut":false,"hidden":false,"merged":[[38,2,38,9],[39,2,39,9],[26,1,26,5],[1,14,1,15],[5,10,5,13],[1,11,1,12],[25,10,25,16]]}
[]
[null,"M4410                   MT4/MT8   M6410/7410               M5410             M6061/M7061          ",null,null,null,null,null,null,null,null,null,"V5005",null,null,"V5004",null,null,null,null,"Accesorios"]
[]
[null,null,null,null,null,null,null,null,null,null,null,null,null,null,null,null,null,null,null,null,null,null,null,null,null,null,"V5004TY10150150","V5004T1","Ninguno","----",null,{"$f":"VLOOKUP(K11,$AA$4:$AB$37,2,FALSE)","v":"V5004T1"},"A",{"$f":"VLOOKUP(K11,AA4:AG37,7,FALSE)","v":"A"}]
[null,null,null,null,null,null,null,null,null,null,null,null,null,null,null,null,null,null,null,null,null,null,null,null,null,null,"V5004TY10150600","V5004T1",null,null,null,{"$f":"VLOOKUP(K12,$AA$4:$AB$37,2,FALSE)","v":{"$error":"#N/A"}},"A"]
[null,"Selector Actuador",null,null,null,null,null,null,null,null,"Tamaño Válvula",null,null,null,null,null,null,null,null,"Equipo de Medida: VM242A101",null,null,null,null,null,null,"V5004TY10150780","V5004T1","Ninguno","----",null,{"$error":"#N/A"},"A"]
[null,"Seleccionar la caracteristica correcta en el campo despegable",null,null,null,null,null,null,null,null,"Introduzca el caudal deseado (l/h)",null,null,null,null,0,null,null,null,null,null,null,null,null,null,null,"V5004TY10201000","V5004T1","Térmico NC","2Pt, 3Pt",null,{"$error":"#N/A"},"A"]
[null,"Seleccionar el tipo de control para válvulas ≤DN32 ",null,null,null,null,null,null,null,null,null,null,null,null,null,null,null,null,null,null,null,null,null,null,null,null,"V5004TY10201500","V5004T1","Térmico NO","0…10V",null,null,"A"]
[null,"Seleccionar el metodo de control en el campo despegable",null,null,null,null,null,null,null,null,null,null,null,null,null,null,null,null,null,null,null,null,null,null,null,null,"V5004TY10251500","V5004T1","Motor",null,null,null,"A"]
[null,"Referencia","Carrera\n mm","\nAccion sin tensión","Tensión","Final de carrera","Tiempo recorrido s","Longitud cable m","Precio en Euros",null,"Selected valve",null,"Min. l/h","Max. l/h","Tamaño\nDN ","Safe\nCons","Precio en Euros",null,null,null,null,null,null,null,null,null,"V5004TY10202200","V5004T1","accion rápido",null,null,null,"B"]
[null,{"$f":"calculator!AY2","v":""},{"$f":"calculator!AZ2","v":""},{"$f":"IFERROR(VLOOKUP(B11,calculator!$AE$2:$AG$58,3,FALSE),\"\")","v":""},{"$f":"IFERROR(VLOOKUP(B11,calculator!$AE$2:$AH$58,4,FALSE),\"\")","v":""},{"$f":"IFERROR(VLOOKUP(B11,calculator!$AE$2:$AL$58,8,FALSE),\"\")","v":""},{"$f":"IFERROR(VLOOKUP(B11,calculator!$AE$2:$AM$58,9,FALSE),\"\")","v":""},{"$f":"IFERROR(VLOOKUP(B11,calculator!$AE$2:$AI$58,5,FALSE),\"\")","v":""},{"$f":"IFERROR(VLOOKUP(B11,Precios!$A$2:$B$87,2,FALSE),\"\")","v":""},null,{"$f":"IFERROR(VLOOKUP(calculator!W2,calculator!$W$2:$W$47,1,FALSE),\"\")","v":"V5004TY10150150"},null,{"$f":"IFERROR(VLOOKUP(K11,calculator!$B$5:$D$38,3,FALSE),\"\")","v":45},{"$f":"IFERROR(VLOOKUP(K11,calculator!$B$5:$F$38,5,FALSE),\"\")","v":150},{"$f":"IFERROR(VLOOKUP(K11,calculator!$B$5:$J$38,9,FALSE),\"\")","v":15},{"$f":"IFERROR(VLOOKUP(K11,calculator!$B$5:$C$38,2,FALSE),\"\")","v":"Si"},{"$f":"IFERROR(VLOOKUP(K11,Precios!$A$2:$B$87,2,FALSE),\"\")","v":0},null,null,null,null,null,null,null,null,null,"V5004TY10202700","V5004T1",null,null,null,null,"B"]
[null,{"$f":"calculator!AY3","v":""},{"$f":"calculator!AZ3","v":""},{"$f":"IFERROR(VLOOKUP(B12,calculator!$AE$2:$AG$58,3,FALSE),\"\")","v":""},{"$f":"IFERROR(VLOOKUP(B12,calculator!$AE$2:$AH$58,4,FALSE),\"\")","v":""},{"$f":"IFERROR(VLOOKUP(B12,calculator!$AE$2:$AL$58,8,FALSE),\"\")","v":""},{"$f":"IFERROR(VLOOKUP(B12,calculator!$AE$2:$AM$58,9,FALSE),\"\")","v":""},{"$f":"IFERROR(VLOOKUP(B12,calculator!AE3:AI59,5,FALSE),\"\")","v":""},{"$f":"IFERROR(VLOOKUP(B12,Precios!$A$2:$B$87,2,FALSE),\"\")","v":""},null,{"$f":"IFERROR(VLOOKUP(calculator!W3,calculator!$W$2:$W$47,1,FALSE),\"\")","v":""},null,{"$f":"IFERROR(VLOOKUP(K12,calculator!$B$5:$D$38,3,FALSE),\"\")","v":""},{"$f":"IFERROR(VLOOKUP(K12,calculator!$B$5:$F$38,5,FALSE),\"\")","v":""},{"$f":"IFERROR(VLOOKUP(K12,calculator!$B$5:$J$38,9,FALSE),\"\")","v":""},{"$f":"IFERROR(VLOOKUP(K12,calculator!$B$5:$C$38,2,FALSE),\"\")","v":""},{"$f":"IFERROR(VLOOKUP(K12,Precios!$A$2:$B$87,2,FALSE),\"\")","v":""},null,null,null,null,null,null,null,null,null,"V5004TY10252200","V5004T1",null,null,null,null,"B"]
[null,{"$f":"calculator!AY4","v":""},{"$f":"calculator!AZ4","v":""},{"$f":"IFERROR(VLOOKUP(B13,calculator!$AE$2:$AG$58,3,FALSE),\"\")","v":""},{"$f":"IFERROR(VLOOKUP(B13,calculator!$AE$2:$AH$58,4,FALSE),\"\")","v":""},{"$f":"IFERROR(VLOOKUP(B13,calculator!$AE$2:$AL$58,8,FALSE),\"\")","v":""},{"$f":"IFERROR(VLOOKUP(B13,calculator!$AE$2:$AM$58,9,FALSE),\"\")","v":""},{"$f":"IFERROR(VLOOKUP(B13,calculator!AE4:AI60,5,FALSE),\"\")","v":""},{"$f":"IFERROR(VLOOKUP(B13,Precios!$A$2:$B$87,2,FALSE),\"\")","v":""},null,{"$f":"IFERROR(VLOOKUP(calculator!W4,calculator!$W$2:$W$47,1,FALSE),\"\")","v":""},null,{"$f":"IFERROR(VLOOKUP(K13,calculator!$B$5:$D$38,3,FALSE),\"\")","v":""},{"$f":"IFERROR(VLOOKUP(K13,calculator!$B$5:$F$38,5,FALSE),\"\")","v":""},{"$f":"IFERROR(VLOOKUP(K13,calculator!$B$5:$J$38,9,FALSE),\"\")","v":""},{"$f":"IFERROR(VLOOKUP(K13,calculator!$B$5:$C$38,2,FALSE),\"\")","v":""},{"$f":"IFERROR(VLOOKUP(K13,Precios!$A$2:$B$87,2,FALSE),\"\")","v":""},null,null,null,null,null,null,null,null,null,"V5004TY10252700","V5004T1",null,{"$f":"IF(P11=40,1,IF(P11=50,1,\"\"))","v":""},null,null,"B"]
[null,{"$f":"calculator!AY5","v":""},{"$f":"calculator!AZ5","v":""},{"$f":"IFERROR(VLOOKUP(B14,calculator!$AE$2:$AG$58,3,FALSE),\"\")","v":""},{"$f":"IFERROR(VLOOKUP(B14,calculator!$AE$2:$AH$58,4,FALSE),\"\")","v":""},{"$f":"IFERROR(VLOOKUP(B14,calculator!$AE$2:$AL$58,8,FALSE),\"\")","v":""},{"$f":"IFERROR(VLOOKUP(B14,calculator!$AE$2:$AM$58,9,FALSE),\"\")","v":""},{"$f":"IFERROR(VLOOKUP(B14,calculator!AE5:AI61,5,FALSE),\"\")","v":""},{"$f":"IFERROR(VLOOKUP(B14,Precios!$A$2:$B$87,2,FALSE),\"\")","v":""},null,{"$f":"IFERROR(VLOOKUP(calculator!W5,calculator!$W$2:$W$47,1,FALSE),\"\")","v":""},null,{"$f":"IFERROR(VLOOKUP(K14,calculator!$B$5:$D$38,3,FALSE),\"\")","v":""},{"$f":"IFERROR(VLOOKUP(K14,calculator!$B$5:$F$38,5,FALSE),\"\")","v":""},{"$f":"IFERROR(VLOOKUP(K14,calculator!$B$5:$J$38,9,FALSE),\"\")","v":""},{"$f":"IFERROR(VLOOKUP(K14,calculator!$B$5:$C$38,2,FALSE),\"\")","v":""},{"$f":"IFERROR(VLOOKUP(K14,Precios!$A$2:$B$87,2,FALSE),\"\")","v":""},null,null,null,null,null,null,null,null,null,"V5004TY10322700","V5004T1",{"$f":"VLOOKUP(K11,calculator!$A$5:$AC$38,29,FALSE)","v":{"$error":"#N/A"}},{"$f":"IF(OR(AC4=\"Térmico NC\",AC4=\"Térmico NO\"),\"THERM\",\"\")","v":""},null,null,"B"]
[null,{"$f":"calculator!AY6","v":""},{"$f":"calculator!AZ6","v":""},{"$f":"IFERROR(VLOOKUP(B15,calculator!$AE$2:$AG$58,3,FALSE),\"\")","v":""},{"$f":"IFERROR(VLOOKUP(B15,calculator!$AE$2:$AH$58,4,FALSE),\"\")","v":""},{"$f":"IFERROR(VLOOKUP(B15,calculator!$AE$2:$AL$58,8,FALSE),\"\")","v":""},{"$f":"IFERROR(VLOOKUP(B15,calculator!$AE$2:$AM$58,9,FALSE),\"\")","v":""},{"$f":"IFERROR(VLOOKUP(B15,calculator!AE6:AI62,5,FALSE),\"\")","v":""},{"$f":"IFERROR(VLOOKUP(B15,Precios!$A$2:$B$87,2,FALSE),\"\")","v":""},null,{"$f":"IFERROR(VLOOKUP(calculator!W6,calculator!$W$2:$W$47,1,FALSE),\"\")","v":""},null,{"$f":"IFERROR(VLOOKUP(K15,calculator!$B$5:$D$38,3,FALSE),\"\")","v":""},{"$f":"IFERROR(VLOOKUP(K15,calculator!$B$5:$F$38,5,FALSE),\"\")","v":""},{"$f":"IFERROR(VLOOKUP(K15,calculator!$B$5:$J$38,9,FALSE),\"\")","v":""},{"$f":"IFERROR(VLOOKUP(K15,calculator!$B$5:$C$38,2,FALSE),\"\")","v":""},{"$f":"IFERROR(VLOOKUP(K15,Precios!$A$2:$B$87,2,FALSE),\"\")","v":""},null,null,"Connectores de lectura: VS2600C1",null,null,null,null,null,null,"V5004TY10323000","V5004T1",null,null,null,null,"B"]
{"$rows_left_out":26}
{"sheet":"calculator","index":1,"n_rows":58,"n_cols":52,"rows_kept":58,"cut":false,"hidden":true,"merged":[]}
[null,"Part Nbr.","safe cons","Min flow rate\nl/h","Recom  Min flow ","Max flow rate\nl/h","Recom  Max flow ","Countif helper","Average flow","DN","Stroke mm","Actuator type","Stroke class PICV","Number Helper","Part Nbr.","Average flow","Valid nbr column J","Helper3","Matching  parts","Ranking","Recommended parts",null,"Parts","Safecon check valves","Min flow","Max flow","DN size","Valve type ","Price",null,"Part","Stroke mm","Powerless action","Voltage","Cable length","Action help","Action","End switch ","Runtime Sec","Helper1\n number","Helper2 identiy Typ","Helper 3 consolid type","Helper 2 identify action2",null,"List of parts","Helper 3 consolid type","Helper stroke valve",null,"Helper3",null,"Part number"]
[null,null,null,null,null,null,null,null,null,null,null,null,null,null,null,null,null,null,null,1,{"$f":"IFERROR(VLOOKUP($X$11&\":\"&T2,$H$5:$O$38,7,FALSE),\"\")","v":1},null,{"$f":"IFERROR(INDEX($B$5:$B$38,$U2,1),\"\")","v":"V5004TY10150150"},{"$f":"IFERROR(VLOOKUP(W2,$B$5:$C$38,2,FALSE),\"\")","v":"Si"},{"$f":"IFERROR(VLOOKUP(W2,B5:$D$38,3,FALSE),\"\")","v":45},{"$f":"IFERROR(VLOOKUP(W2,$B$5:$F$38,5,FALSE),\"\")","v":150},{"$f":"IFERROR(VLOOKUP(W2,B5:$J$38,9,FALSE),\"\")","v":15},{"$f":"IFERROR(VLOOKUP(W2,B5:$M$38,12,FALSE),\"\")","v":"A"},null,"Térmico NO","MT4-024-NO",4,"Abre","24Vac/dc",1,"2Pt, 3Pt","A","no",240,1,{"$f":"IF(AND($X$12=AD2,AK2=AB$2),AN2,\"\")","v":""},{"$f":"IFERROR(SMALL($AO$2:$AO$58,ROWS($AO$2:AO2)),\"\")","v":""},{"$f":"IFERROR(VLOOKUP(AS2,$AE$2:$AK$58,6,FALSE),\"\")","v":""},null,{"$f":"IFERROR(INDEX($AE$2:$AK$58,$AP2,COLUMNS($AR$2:AR2)),\"\")","v":""},{"$f":"IFERROR(SMALL($AO$2:$AO$58,ROWS($AO$2:AS2)),\"\")","v":""},{"$f":"IFERROR(VLOOKUP(AS2,$AE$2:$AJ$58,6,FALSE),\"\")","v":""},{"$f":"IF($X$13=AU2,AT2,\"\")","v":""},{"$f":"IFERROR(SMALL($AV$2:$AV$58,ROWS($F$4:F4)),\"\")","v":""},null,{"$f":"IFERROR(INDEX($AE$2:$AM$58,$AW2,COLUMNS($AX$2:AX2)),\"\")","v":""},{"$f":"IFERROR(VLOOKUP(AY2,AE2:$AF$58,2,FALSE),\"\")","v":""}]
[null,null,null,null,null,null,null,null,null,null,null,null,null,null,null,null,null,null,null,2,"",null,{"$f":"IFERROR(INDEX($B$5:$B$38,$U3,1),\"\")","v":""},{"$f":"IFERROR(VLOOKUP(W3,$B$5:$C$38,2,FALSE),\"\")","v":""},{"$f":"IFERROR(VLOOKUP(W3,B6:$D$38,3,FALSE),\"\")","v":""},{"$f":"IFERROR(VLOOKUP(W3,$B$5:$F$38,5,FALSE),\"\")","v":""},{"$f":"IFERROR(VLOOKUP(W3,B6:$J$38,9,FALSE),\"\")","v":""},{"$f":"IFERROR(VLOOKUP(W3,B6:$M$38,12,FALSE),\"\")","v":""},null,"Térmico NO","MT4-024-NO-2.5M",4,"Abre","24Vac/dc",2.5,"2Pt, 3Pt","A","no",240,2,{"$f":"IF(AND($X$12=AD3,AK3=AB$2),AN3,\"\")","v":""},{"$f":"IFERROR(SMALL($AO$2:$AO$58,ROWS($AO$2:AO3)),\"\")","v":""},"",null,{"$f":"IFERROR(INDEX($AE$2:$AK$58,$AP3,COLUMNS($AR$2:AR3)),\"\")","v":""},{"$f":"IFERROR(SMALL($AO$2:$AO$58,ROWS($AO$2:AS3)),\"\")","v":""},{"$f":"IFERROR(VLOOKUP(AS3,$AE$2:$AJ$58,6,FALSE),\"\")","v":""},{"$f":"IF($X$13=AU3,AT3,\"\")","v":""},{"$f":"IFERROR(SMALL($AV$2:$AV$58,ROWS($F$4:F5)),\"\")","v":""},null,{"$f":"IFERROR(INDEX($AE$2:$AM$58,$AW3,COLUMNS($AX$2:AX3)),\"\")","v":""},{"$f":"IFERROR(VLOOKUP(AY3,AE3:$AF$58,2,FALSE),\"\")","v":""}]
[null,null,null,null,null,null,null,null,null,null,null,null,null,null,null,null,null,null,null,3,"",null,"","",{"$f":"IFERROR(VLOOKUP(W4,B7:$D$38,3,FALSE),\"\")","v":""},"",{"$f":"IFERROR(VLOOKUP(W4,B7:$J$38,9,FALSE),\"\")","v":""},{"$f":"IFERROR(VLOOKUP(W4,B7:$M$38,12,FALSE),\"\")","v":""},null,"Térmico NO","MT4-024S-NO",4,"Abre","24Vac/dc",1,"2Pt, 3Pt","A",1,240,3,"",{"$f":"IFERROR(SMALL($AO$2:$AO$58,ROWS($AO$2:AO4)),\"\")","v":""},"",null,{"$f":"IFERROR(INDEX($AE$2:$AK$58,$AP4,COLUMNS($AR$2:AR4)),\"\")","v":""},{"$f":"IFERROR(SMALL($AO$2:$AO$58,ROWS($AO$2:AS4)),\"\")","v":""},"",{"$f":"IF($X$13=AU4,AT4,\"\")","v":""},{"$f":"IFERROR(SMALL($AV$2:$AV$58,ROWS($F$4:F6)),\"\")","v":""},null,{"$f":"IFERROR(INDEX($AE$2:$AM$58,$AW4,COLUMNS($AX$2:AX4)),\"\")","v":""},{"$f":"IFERROR(VLOOKUP(AY4,AE4:$AF$58,2,FALSE),\"\")","v":""}]
["V5004T1","V5004TY10150150","Si",45,58.5,150,{"$f":"F5*0.85","v":127.5},{"$f":"I5&\":\"&COUNTIF($I$5:I5,I5)","v":"93:1"},{"$f":"IFERROR((E5+G5)/2,0)","v":93},15,2.9,"Linear","A",1,{"$f":"IF(AND($X$10>E5,$X$10<G5),B5,\"\")","v":""},{"$f":"IF(O5=B5,I5,\"\")","v":""},{"$f":"IF(O5=B5,N5,\"\")","v":""},{"$f":"IFERROR(SMALL($Q$5:$Q$38,ROWS(Q$5:$Q5)),\"\")","v":""},{"$f":"IFERROR(INDEX($B$5:$N$38,$R5,COLUMNS($B$5:B5)),\"\")","v":""},4,"",null,"","",{"$f":"IFERROR(VLOOKUP(W5,B8:$D$38,3,FALSE),\"\")","v":""},"",{"$f":"IFERROR(VLOOKUP(W5,B8:$J$38,9,FALSE),\"\")","v":""},{"$f":"IFERROR(VLOOKUP(W5,B8:$M$38,12,FALSE),\"\")","v":""},{"$f":"A5","v":"V5004T1"},"Térmico NC","MT4-024-NC",4,"Cierra","24Vac/dc",1,"2Pt, 3Pt","A","no",240,4,"",{"$f":"IFERROR(SMALL($AO$2:$AO$58,ROWS($AO$2:AO5)),\"\")","v":""},"",null,{"$f":"IFERROR(INDEX($AE$2:$AK$58,$AP5,COLUMNS($AR$2:AR5)),\"\")","v":""},{"$f":"IFERROR(SMALL($AO$2:$AO$58,ROWS($AO$2:AS5)),\"\")","v":""},"","",{"$f":"IFERROR(SMALL($AV$2:$AV$58,ROWS($F$4:F7)),\"\")","v":""},null,{"$f":"IFERROR(INDEX($AE$2:$AM$58,$AW5,COLUMNS($AX$2:AX5)),\"\")","v":""},{"$f":"IFERROR(VLOOKUP(AY5,AE5:$AF$58,2,FALSE),\"\")","v":""}]
["V5004T1","V5004TY10150600","Si",60,78,600,{"$f":"F6*0.85","v":510},{"$f":"I6&\":\"&COUNTIF($I$5:I6,I6)","v":"294:1"},294,15,2.9,"Linear","A",2,"","","",{"$f":"IFERROR(SMALL($Q$5:$Q$38,ROWS(Q$5:$Q6)),\"\")","v":""},{"$f":"IFERROR(INDEX($B$5:$N$38,$R6,COLUMNS($B$5:B6)),\"\")","v":""},5,"",null,"","",{"$f":"IFERROR(VLOOKUP(W6,B9:$D$38,3,FALSE),\"\")","v":""},"",{"$f":"IFERROR(VLOOKUP(W6,B9:$J$38,9,FALSE),\"\")","v":""},{"$f":"IFERROR(VLOOKUP(W6,B9:$M$38,12,FALSE),\"\")","v":""},{"$f":"A6","v":"V5004T1"},"Térmico NC","MT4-024-NC-2.5M",4,"Cierra","24Vac/dc",2.5,"2Pt, 3Pt","A","no",240,5,"",{"$f":"IFERROR(SMALL($AO$2:$AO$58,ROWS($AO$2:AO6)),\"\")","v":""},"",null,{"$f":"IFERROR(INDEX($AE$2:$AK$58,$AP6,COLUMNS($AR$2:AR6)),\"\")","v":""},{"$f":"IFERROR(SMALL($AO$2:$AO$58,ROWS($AO$2:AS6)),\"\")","v":""},"","",{"$f":"IFERROR(SMALL($AV$2:$AV$58,ROWS($F$4:F8)),\"\")","v":""},null,{"$f":"IFERROR(INDEX($AE$2:$AM$58,$AW6,COLUMNS($AX$2:AX6)),\"\")","v":""},{"$f":"IFERROR(VLOOKUP(AY6,AE6:$AF$58,2,FALSE),\"\")","v":""}]
["V5004T1","V5004TY10150780","Si",78,101.4,780,663,{"$f":"I7&\":\"&COUNTIF($I$5:I7,I7)","v":"382.2:1"},382.2,15,2.9,"Linear","A",3,"","","",{"$f":"IFERROR(SMALL($Q$5:$Q$38,ROWS(Q$5:$Q7)),\"\")","v":""},{"$f":"IFERROR(INDEX($B$5:$N$38,$R7,COLUMNS($B$5:B7)),\"\")","v":""},6,"",null,"","",{"$f":"IFERROR(VLOOKUP(W7,B10:$D$38,3,FALSE),\"\")","v":""},"",{"$f":"IFERROR(VLOOKUP(W7,B10:$J$38,9,FALSE),\"\")","v":""},{"$f":"IFERROR(VLOOKUP(W7,B10:$M$38,12,FALSE),\"\")","v":""},"V5004T1","Térmico NC","MT4-024S-NC",4,"Cierra","24Vac/dc",1,"2Pt, 3Pt","A",1,240,6,"",{"$f":"IFERROR(SMALL($AO$2:$AO$58,ROWS($AO$2:AO7)),\"\")","v":""},"",null,{"$f":"IFERROR(INDEX($AE$2:$AK$58,$AP7,COLUMNS($AR$2:AR7)),\"\")","v":""},{"$f":"IFERROR(SMALL($AO$2:$AO$58,ROWS($AO$2:AS7)),\"\")","v":""},"","",{"$f":"IFERROR(SMALL($AV$2:$AV$58,ROWS($F$4:F9)),\"\")","v":""},null,{"$f":"IFERROR(INDEX($AE$2:$AM$58,$AW7,COLUMNS($AX$2:AX7)),\"\")","v":""},{"$f":"IFERROR(VLOOKUP(AY7,AE7:$AF$58,2,FALSE),\"\")","v":""}]
["V5004T1","V5004TY10201000","Si",100,130,1000,850,{"$f":"I8&\":\"&COUNTIF($I$5:I8,I8)","v":"490:1"},490,20,2.9,"Linear","A",4,"","","",{"$f":"IFERROR(SMALL($Q$5:$Q$38,ROWS(Q$5:$Q8)),\"\")","v":""},{"$f":"IFERROR(INDEX($B$5:$N$38,$R8,COLUMNS($B$5:B8)),\"\")","v":""},7,"",null,"","",{"$f":"IFERROR(VLOOKUP(W8,B11:$D$38,3,FALSE),\"\")","v":""},"",{"$f":"IFERROR(VLOOKUP(W8,B11:$J$38,9,FALSE),\"\")","v":""},{"$f":"IFERROR(VLOOKUP(W8,B11:$M$38,12,FALSE),\"\")","v":""},"V5004T1","Térmico NO","MT4-230-NO",4,"Abre","230Vac",1,"2Pt, 3Pt","A","no",240,7,"",{"$f":"IFERROR(SMALL($AO$2:$AO$58,ROWS($AO$2:AO8)),\"\")","v":""},"",null,{"$f":"IFERROR(INDEX($AE$2:$AK$58,$AP8,COLUMNS($AR$2:AR8)),\"\")","v":""},{"$f":"IFERROR(SMALL($AO$2:$AO$58,ROWS($AO$2:AS8)),\"\")","v":""},"","",{"$f":"IFERROR(SMALL($AV$2:$AV$58,ROWS($F$4:F10)),\"\")","v":""},null,{"$f":"IFERROR(INDEX($AE$2:$AM$58,$AW8,COLUMNS($AX$2:AX8)),\"\")","v":""},{"$f":"IFERROR(VLOOKUP(AY8,AE8:$AF$58,2,FALSE),\"\")","v":""}]
["V5004T1","V5004TY10201500","Si",450,585,1500,1275,{"$f":"I9&\":\"&COUNTIF($I$5:I9,I9)","v":"930:1"},930,20,2.9,"Linear","A",5,"","","",{"$f":"IFERROR(SMALL($Q$5:$Q$38,ROWS(Q$5:$Q9)),\"\")","v":""},{"$f":"IFERROR(INDEX($B$5:$N$38,$R9,COLUMNS($B$5:B9)),\"\")","v":""},null,null,null,null,null,{"$f":"IFERROR(VLOOKUP(U12,B12:D45,3,FALSE),\"\")","v":""},{"$f":"IFERROR(VLOOKUP(U12,B12:L45,5,FALSE),\"\")","v":""},{"$f":"IFERROR(VLOOKUP(U12,B12:L45,9,FALSE),\"\")","v":""},null,"V5004T1","Térmico NO","MT4-230-NO-2.5M",4,"Abre","230Vac",2.5,"2Pt, 3Pt","A","no",240,8,"",{"$f":"IFERROR(SMALL($AO$2:$AO$58,ROWS($AO$2:AO9)),\"\")","v":""},"",null,{"$f":"IFERROR(INDEX($AE$2:$AK$58,$AP9,COLUMNS($AR$2:AR9)),\"\")","v":""},{"$f":"IFERROR(SMALL($AO$2:$AO$58,ROWS($AO$2:AS9)),\"\")","v":""},"","",{"$f":"IFERROR(SMALL($AV$2:$AV$58,ROWS($F$4:F11)),\"\")","v":""},null,{"$f":"IFERROR(INDEX($AE$2:$AM$58,$AW9,COLUMNS($AX$2:AX9)),\"\")","v":""},{"$f":"IFERROR(VLOOKUP(AY9,AE9:$AF$58,2,FALSE),\"\")","v":""}]
["V5004T1","V5004TY10251500","Si",450,585,1500,1275,{"$f":"I10&\":\"&COUNTIF($I$5:I10,I10)","v":"930:2"},930,25,2.9,"Linear","A",6,"","","",{"$f":"IFERROR(SMALL($Q$5:$Q$38,ROWS(Q$5:$Q10)),\"\")","v":""},{"$f":"IFERROR(INDEX($B$5:$N$38,$R10,COLUMNS($B$5:B10)),\"\")","v":""},null,0,null,null,{"$f":"Español!P7","v":0},{"$f":"IFERROR(VLOOKUP(U13,B13:D46,3,FALSE),\"\")","v":""},{"$f":"IFERROR(VLOOKUP(U13,B13:L46,5,FALSE),\"\")","v":""},{"$f":"IFERROR(VLOOKUP(U13,B13:L46,9,FALSE),\"\")","v":""},null,"V5004T1","Térmico NO","MT4-230S-NO",4,"Abre","230Vac",1,"2Pt, 3Pt","A",1,240,9,"",{"$f":"IFERROR(SMALL($AO$2:$AO$58,ROWS($AO$2:AO10)),\"\")","v":""},"",null,{"$f":"IFERROR(INDEX($AE$2:$AK$58,$AP10,COLUMNS($AR$2:AR10)),\"\")","v":""},{"$f":"IFERROR(SMALL($AO$2:$AO$58,ROWS($AO$2:AS10)),\"\")","v":""},"","",{"$f":"IFERROR(SMALL($AV$2:$AV$58,ROWS($F$4:F12)),\"\")","v":""},null,{"$f":"IFERROR(INDEX($AE$2:$AM$58,$AW10,COLUMNS($AX$2:AX10)),\"\")","v":""},{"$f":"IFERROR(VLOOKUP(AY10,AE10:$AF$58,2,FALSE),\"\")","v":""}]
["V5004T1","V5004TY10202200","Si",220,286,2200,1870,{"$f":"I11&\":\"&COUNTIF($I$5:I11,I11)","v":"1078:1"},1078,20,6,"Linear","B",7,"","","",{"$f":"IFERROR(SMALL($Q$5:$Q$38,ROWS(Q$5:$Q11)),\"\")","v":""},{"$f":"IFERROR(INDEX($B$5:$N$38,$R11,COLUMNS($B$5:B11)),\"\")","v":""},null,"Closest flow l/h",null,null,{"$f":"INDEX(I5:I38,MATCH(MIN(ABS(I5:I38-X10)),ABS(I5:I38-X10),0))","v":93},{"$f":"IFERROR(VLOOKUP(U14,B14:D47,3,FALSE),\"\")","v":""},{"$f":"IFERROR(VLOOKUP(U14,B14:L47,5,FALSE),\"\")","v":""},{"$f":"IFERROR(VLOOKUP(U14,B14:L47,9,FALSE),\"\")","v":""},null,"V5004T1","Térmico NC","MT4-230-NC",4,"Cierra","230Vac",1,"2Pt, 3Pt","A","no",240,10,"",{"$f":"IFERROR(SMALL($AO$2:$AO$58,ROWS($AO$2:AO11)),\"\")","v":""},"",null,{"$f":"IFERROR(INDEX($AE$2:$AK$58,$AP11,COLUMNS($AR$2:AR11)),\"\")","v":""},{"$f":"IFERROR(SMALL($AO$2:$AO$58,ROWS($AO$2:AS11)),\"\")","v":""},"","",{"$f":"IFERROR(SMALL($AV$2:$AV$58,ROWS($F$4:F13)),\"\")","v":""},null,{"$f":"IFERROR(INDEX($AE$2:$AM$58,$AW11,COLUMNS($AX$2:AX11)),\"\")","v":""},{"$f":"IFERROR(VLOOKUP(AY11,AE11:$AF$58,2,FALSE),\"\")","v":""}]
["V5004T1","V5004TY10202700","Si",270,351,2700,2295,{"$f":"I12&\":\"&COUNTIF($I$5:I12,I12)","v":"1323:1"},1323,20,6,"Linear","B",8,"","","",{"$f":"IFERROR(SMALL($Q$5:$Q$38,ROWS(Q$5:$Q12)),\"\")","v":""},{"$f":"IFERROR(INDEX($B$5:$N$38,$R12,COLUMNS($B$5:B12)),\"\")","v":""},null,"Type of actuator:",null,null,{"$f":"Español!AC4","v":"Ninguno"},{"$f":"IFERROR(VLOOKUP(#REF!,B15:D48,3,FALSE),\"\")","v":""},{"$f":"IFERROR(VLOOKUP(#REF!,B15:L48,5,FALSE),\"\")","v":""},{"$f":"IFERROR(VLOOKUP(#REF!,B15:L48,9,FALSE),\"\")","v":""},null,"V5004T1","Térmico NC","MT4-230-NC-2.5M",4,"Cierra","230Vac",2.5,"2Pt, 3Pt","A","no",240,11,"",{"$f":"IFERROR(SMALL($AO$2:$AO$58,ROWS($AO$2:AO12)),\"\")","v":""},"",null,{"$f":"IFERROR(INDEX($AE$2:$AK$58,$AP12,COLUMNS($AR$2:AR12)),\"\")","v":""},{"$f":"IFERROR(SMALL($AO$2:$AO$58,ROWS($AO$2:AS12)),\"\")","v":""},"","",{"$f":"IFERROR(SMALL($AV$2:$AV$58,ROWS($F$4:F14)),\"\")","v":""},null,{"$f":"IFERROR(INDEX($AE$2:$AM$58,$AW12,COLUMNS($AX$2:AX12)),\"\")","v":""},{"$f":"IFERROR(VLOOKUP(AY12,AE12:$AF$58,2,FALSE),\"\")","v":""}]
["V5004T1","V5004TY10252200","Si",220,286,2200,1870,{"$f":"I13&\":\"&COUNTIF($I$5:I13,I13)","v":"1078:2"},1078,25,6,"Linear","B",9,"","","",{"$f":"IFERROR(SMALL($Q$5:$Q$38,ROWS(Q$5:$Q13)),\"\")","v":""},{"$f":"IFERROR(INDEX($B$5:$N$38,$R13,COLUMNS($B$5:B13)),\"\")","v":""},null,"Signal",null,null,{"$f":"Español!AD4","v":"----"},{"$f":"IFERROR(VLOOKUP(#REF!,B16:D49,3,FALSE),\"\")","v":""},{"$f":"IFERROR(VLOOKUP(#REF!,B16:L49,5,FALSE),\"\")","v":""},{"$f":"IFERROR(VLOOKUP(#REF!,B16:L49,9,FALSE),\"\")","v":""},null,"V5004T1","Térmico NC","MT4-230S-NC",4,"Cierra","230Vac",1,"2Pt, 3Pt","A",1,240,12,"",{"$f":"IFERROR(SMALL($AO$2:$AO$58,ROWS($AO$2:AO13)),\"\")","v":""},"",null,{"$f":"IFERROR(INDEX($AE$2:$AK$58,$AP13,COLUMNS($AR$2:AR13)),\"\")","v":""},{"$f":"IFERROR(SMALL($AO$2:$AO$58,ROWS($AO$2:AS13)),\"\")","v":""},"","",{"$f":"IFERROR(SMALL($AV$2:$AV$58,ROWS($F$4:F15)),\"\")","v":""},null,{"$f":"IFERROR(INDEX($AE$2:$AM$58,$AW13,COLUMNS($AX$2:AX13)),\"\")","v":""},{"$f":"IFERROR(VLOOKUP(AY13,AE13:$AF$58,2,FALSE),\"\")","v":""}]
["V5004T1","V5004TY10252700","Si",270,351,3000,2550,{"$f":"I14&\":\"&COUNTIF($I$5:I14,I14)","v":"1450.5:1"},1450.5,25,6,"Linear","B",10,"","","",{"$f":"IFERROR(SMALL($Q$5:$Q$38,ROWS(Q$5:$Q14)),\"\")","v":""},{"$f":"IFERROR(INDEX($B$5:$N$38,$R14,COLUMNS($B$5:B14)),\"\")","v":""},null,"Action",null,null,{"$f":"IF(X12=\"Therm NC\",\"Close\",IF(X12=\"Therm NO\",\"Open\",\"\"))","v":""},{"$f":"IFERROR(VLOOKUP(#REF!,B17:D50,3,FALSE),\"\")","v":""},{"$f":"IFERROR(VLOOKUP(#REF!,B17:L50,5,FALSE),\"\")","v":""},{"$f":"IFERROR(VLOOKUP(#REF!,B17:L50,9,FALSE),\"\")","v":""},null,"V5004T1","Térmico NO","MT8-024-NO",8,"Abre","24Vac/dc",1,"2Pt, 3Pt","B","no",360,13,"",{"$f":"IFERROR(SMALL($AO$2:$AO$58,ROWS($AO$2:AO14)),\"\")","v":""},"",null,{"$f":"IFERROR(INDEX($AE$2:$AK$58,$AP14,COLUMNS($AR$2:AR14)),\"\")","v":""},{"$f":"IFERROR(SMALL($AO$2:$AO$58,ROWS($AO$2:AS14)),\"\")","v":""},"","",{"$f":"IFERROR(SMALL($AV$2:$AV$58,ROWS($F$4:F16)),\"\")","v":""},null,{"$f":"IFERROR(INDEX($AE$2:$AM$58,$AW14,COLUMNS($AX$2:AX14)),\"\")","v":""},{"$f":"IFERROR(VLOOKUP(AY14,AE14:$AF$58,2,FALSE),\"\")","v":""}]
["V5004T1","V5004TY10322700","Si",270,351,3000,2550,{"$f":"I15&\":\"&COUNTIF($I$5:I15,I15)","v":"1450.5:2"},1450.5,32,6,"Linear","B",11,"","","",{"$f":"IFERROR(SMALL($Q$5:$Q$38,ROWS(Q$5:$Q15)),\"\")","v":""},{"$f":"IFERROR(INDEX($B$5:$N$38,$R15,COLUMNS($B$5:B15)),\"\")","v":""},null,"List of actuators",null,null,null,{"$f":"IFERROR(VLOOKUP(U15,B18:D51,3,FALSE),\"\")","v":""},{"$f":"IFERROR(VLOOKUP(U15,B18:L51,5,FALSE),\"\")","v":""},{"$f":"IFERROR(VLOOKUP(U15,B18:L51,9,FALSE),\"\")","v":""},null,"V5004T1","Térmico NO","MT8-024-NO-2.5M",8,"Abre","24Vac/dc",2.5,"2Pt, 3Pt","B","no",360,14,"",{"$f":"IFERROR(SMALL($AO$2:$AO$58,ROWS($AO$2:AO15)),\"\")","v":""},"",null,{"$f":"IFERROR(INDEX($AE$2:$AK$58,$AP15,COLUMNS($AR$2:AR15)),\"\")","v":""},{"$f":"IFERROR(SMALL($AO$2:$AO$58,ROWS($AO$2:AS15)),\"\")","v":""},"","",{"$f":"IFERROR(SMALL($AV$2:$AV$58,ROWS($F$4:F17)),\"\")","v":""},null,{"$f":"IFERROR(INDEX($AE$2:$AM$58,$AW15,COLUMNS($AX$2:AX15)),\"\")","v":""},{"$f":"IFERROR(VLOOKUP(AY15,AE15:$AF$58,2,FALSE),\"\")","v":""}]
{"$rows_left_out":44}
{"sheet":"Precios","index":2,"n_rows":87,"n_cols":2,"rows_kept":87,"cut":false,"hidden":false,"merged":[]}
["Referencia","Precio €"]
["MT4-024-NO"]
["MT4-024-NO-2.5M"]
["MT4-024S-NO"]
["MT4-024-NC"]
["MT4-024-NC-2.5M"]
["MT4-024S-NC"]
["MT4-230-NO"]
["MT4-230-NO-2.5M"]
["MT4-230S-NO"]
["MT4-230-NC"]
["MT4-230-NC-2.5M"]
["MT4-230S-NC"]
["MT8-024-NO"]
["MT8-024-NO-2.5M"]
{"$rows_left_out":72}