{"text_format":"1","workbook":"xlsx","n_sheets":3,"sheets":["Español","calculator","Precios"],"not_rendered":{"charts":0,"images":13,"macros":1,"external_links":1,"defined_names":7,"comments":0,"pivot_tables":0},"unopened":[],"bounds":{"document_bytes":16777216,"sheet_cells":100000,"rows_first":2000,"rows_last":500,"rows_between":2000,"halvings":0,"cell_chars":16384,"cell_head_chars":4096},"cells_cut":0,"cells_raw":0,"read":"whole","date_system":"1900"}

{"sheet":"Español","index":0,"n_rows":40,"n_cols":34,"rows_kept":40,"cut":false,"hidden":false,"merged":[[38,2,38,9],[39,2,39,9],[26,1,26,5],[1,14,1,15],[5,10,5,13],[1,11,1,12],[25,10,25,16]]}
[]
[null,"M4410                   MT4/MT8   M6410/7410               M5410             M6061/M7061          ",null,null,null,null,null,null,null,null,null,"V5005",null,null,"V5004",null,null,null,null,"Accesorios"]
[]
[null,null,null,null,null,null,null,null,null,null,null,null,null,null,null,null,null,null,null,null,null,null,null,null,null,null,"V5004TY10150150","V5004T1","Ninguno","----",null,{"$f":"VLOOKUP(K11,$AA$4:$AB$37,2,FALSE)","v":"V5004T1"},"A",{"$f":"VLOOKUP(K11,AA4:AG37,7,FALSE)","v":"A"}]
[null,null,null,null,null,null,null,null,null,null,null,null,null,null,null,null,null,null,null,null,null,null,null,null,null,null,"V5004TY10150600","V5004T1",null,null,null,{"$f":"VLOOKUP(K12,$AA$4:$AB$37,2,FALSE)","v":{"$error":"#N/A"}},"A"]
[null,"Selector Actuador",null,null,null,null,null,null,null,null,"Tamaño Válvula",null,null,null,null,null,null,null,null,"Equipo de Medida: VM242A101",null,null,null,null,null,null,"V5004TY10150780","V5004T1","Ninguno","----",null,{"$error":"#N/A"},"A"]
[null,"Seleccionar la caracteristica correcta en el campo despegable",null,null,null,null,null,null,null,null,"Introduzca el caudal deseado (l/h)",null,null,null,null,0,null,null,null,null,null,null,null,null,null,null,"V5004TY10201000","V5004T1","Térmico NC","2Pt, 3Pt",null,{"$error":"#N/A"},"A"]
[null,"Seleccionar el tipo de control para válvulas ≤DN32 ",null,null,null,null,null,null,null,null,null,null,null,null,null,null,null,null,null,null,null,null,null,null,null,null,"V5004TY10201500","V5004T1","Térmico NO","0…10V",null,null,"A"]
[null,"Seleccionar el metodo de control en el campo despegable",null,null,null,null,null,null,null,null,null,null,null,null,null,null,null,null,null,null,null,null,null,null,null,null,"V5004TY10251500","V5004T1","Motor",null,null,null,"A"]
[null,"Referencia","Carrera\n mm","\nAccion sin tensión","Tensión","Final de carrera","Tiempo recorrido s","Longitud cable m","Precio en Euros",null,"Selected valve",null,"Min. l/h","Max. l/h","Tamaño\nDN ","Safe\nCons","Precio en Euros",null,null,null,null,null,null,null,null,null,"V5004TY10202200","V5004T1","accion rápido",null,null,null,"B"]
[null,{"$f":"calculator!AY2","v":""},{"$f":"calculator!AZ2","v":""},{"$f":"IFERROR(VLOOKUP(B11,calculator!$AE$2:$AG$58,3,FALSE),\"\")","v":""},{"$f":"IFERROR(VLOOKUP(B11,calculator!$AE$2:$AH$58,4,FALSE),\"\")","v":""},{"$f":"IFERROR(VLOOKUP(B11,calculator!$AE$2:$AL$58,8,FALSE),\"\")","v":""},{"$f":"IFERROR(VLOOKUP(B11,calculator!$AE$2:$AM$58,9,FALSE),\"\")","v":""},{"$f":"IFERROR(VLOOKUP(B11,calculator!$AE$2:$AI$58,5,FALSE),\"\")","v":""},{"$f":"IFERROR(VLOOKUP(B11,Precios!$A$2:$B$87,2,FALSE),\"\")","v":""},null,{"$f":"IFERROR(VLOOKUP(calculator!W2,calculator!$W$2:$W$47,1,FALSE),\"\")","v":"V5004TY10150150"},null,{"$f":"IFERROR(VLOOKUP(K11,calculator!$B$5:$D$38,3,FALSE),\"\")","v":45},{"$f":"IFERROR(VLOOKUP(K11,calculator!$B$5:$F$38,5,FALSE),\"\")","v":150},{"$f":"IFERROR(VLOOKUP(K11,calculator!$B$5:$J$38,9,FALSE),\"\")","v":15},{"$f":"IFERROR(VLOOKUP(K11,calculator!$B$5:$C$38,2,FALSE),\"\")","v":"Si"},{"$f":"IFERROR(VLOOKUP(K11,Precios!$A$2:$B$87,2,FALSE),\"\")","v":0},null,null,null,null,null,null,null,null,null,"V5004TY10202700","V5004T1",null,null,null,null,"B"]
[null,{"$f":"calculator!AY3","v":""},{"$f":"calculator!AZ3","v":""},{"$f":"IFERROR(VLOOKUP(B12,calculator!$AE$2:$AG$58,3,FALSE),\"\")","v":""},{"$f":"IFERROR(VLOOKUP(B12,calculator!$AE$2:$AH$58,4,FALSE),\"\")","v":""},{"$f":"IFERROR(VLOOKUP(B12,calculator!$AE$2:$AL$58,8,FALSE),\"\")","v":""},{"$f":"IFERROR(VLOOKUP(B12,calculator!$AE$2:$AM$58,9,FALSE),\"\")","v":""},{"$f":"IFERROR(VLOOKUP(B12,calculator!AE3:AI59,5,FALSE),\"\")","v":""},{"$f":"IFERROR(VLOOKUP(B12,Precios!$A$2:$B$87,2,FALSE),\"\")","v":""},null,{"$f":"IFERROR(VLOOKUP(calculator!W3,calculator!$W$2:$W$47,1,FALSE),\"\")","v":""},null,{"$f":"IFERROR(VLOOKUP(K12,calculator!$B$5:$D$38,3,FALSE),\"\")","v":""},{"$f":"IFERROR(VLOOKUP(K12,calculator!$B$5:$F$38,5,FALSE),\"\")","v":""},{"$f":"IFERROR(VLOOKUP(K12,calculator!$B$5:$J$38,9,FALSE),\"\")","v":""},{"$f":"IFERROR(VLOOKUP(K12,calculator!$B$5:$C$38,2,FALSE),\"\")","v":""},{"$f":"IFERROR(VLOOKUP(K12,Precios!$A$2:$B$87,2,FALSE),\"\")","v":""},null,null,null,null,null,null,null,null,null,"V5004TY10252200","V5004T1",null,null,null,null,"B"]
[null,{"$f":"calculator!AY4","v":""},{"$f":"calculator!AZ4","v":""},{"$f":"IFERROR(VLOOKUP(B13,calculator!$AE$2:$AG$58,3,FALSE),\"\")","v":""},{"$f":"IFERROR(VLOOKUP(B13,calculator!$AE$2:$AH$58,4,FALSE),\"\")","v":""},{"$f":"IFERROR(VLOOKUP(B13,calculator!$AE$2:$AL$58,8,FALSE),\"\")","v":""},{"$f":"IFERROR(VLOOKUP(B13,calculator!$AE$2:$AM$58,9,FALSE),\"\")","v":""},{"$f":"IFERROR(VLOOKUP(B13,calculator!AE4:AI60,5,FALSE),\"\")","v":""},{"$f":"IFERROR(VLOOKUP(B13,Precios!$A$2:$B$87,2,FALSE),\"\")","v":""},null,{"$f":"IFERROR(VLOOKUP(calculator!W4,calculator!$W$2:$W$47,1,FALSE),\"\")","v":""},null,{"$f":"IFERROR(VLOOKUP(K13,calculator!$B$5:$D$38,3,FALSE),\"\")","v":""},{"$f":"IFERROR(VLOOKUP(K13,calculator!$B$5:$F$38,5,FALSE),\"\")","v":""},{"$f":"IFERROR(VLOOKUP(K13,calculator!$B$5:$J$38,9,FALSE),\"\")","v":""},{"$f":"IFERROR(VLOOKUP(K13,calculator!$B$5:$C$38,2,FALSE),\"\")","v":""},{"$f":"IFERROR(VLOOKUP(K13,Precios!$A$2:$B$87,2,FALSE),\"\")","v":""},null,null,null,null,null,null,null,null,null,"V5004TY10252700","V5004T1",null,{"$f":"IF(P11=40,1,IF(P11=50,1,\"\"))","v":""},null,null,"B"]
[null,{"$f":"calculator!AY5","v":""},{"$f":"calculator!AZ5","v":""},{"$f":"IFERROR(VLOOKUP(B14,calculator!$AE$2:$AG$58,3,FALSE),\"\")","v":""},{"$f":"IFERROR(VLOOKUP(B14,calculator!$AE$2:$AH$58,4,FALSE),\"\")","v":""},{"$f":"IFERROR(VLOOKUP(B14,calculator!$AE$2:$AL$58,8,FALSE),\"\")","v":""},{"$f":"IFERROR(VLOOKUP(B14,calculator!$AE$2:$AM$58,9,FALSE),\"\")","v":""},{"$f":"IFERROR(VLOOKUP(B14,calculator!AE5:AI61,5,FALSE),\"\")","v":""},{"$f":"IFERROR(VLOOKUP(B14,Precios!$A$2:$B$87,2,FALSE),\"\")","v":""},null,{"$f":"IFERROR(VLOOKUP(calculator!W5,calculator!$W$2:$W$47,1,FALSE),\"\")","v":""},null,{"$f":"IFERROR(VLOOKUP(K14,calculator!$B$5:$D$38,3,FALSE),\"\")","v":""},{"$f":"IFERROR(VLOOKUP(K14,calculator!$B$5:$F$38,5,FALSE),\"\")","v":""},{"$f":"IFERROR(VLOOKUP(K14,calculator!$B$5:$J$38,9,FALSE),\"\")","v":""},{"$f":"IFERROR(VLOOKUP(K14,calculator!$B$5:$C$38,2,FALSE),\"\")","v":""},{"$f":"IFERROR(VLOOKUP(K14,Precios!$A$2:$B$87,2,FALSE),\"\")","v":""},null,null,null,null,null,null,null,null,null,"V5004TY10322700","V5004T1",{"$f":"VLOOKUP(K11,calculator!$A$5:$AC$38,29,FALSE)","v":{"$error":"#N/A"}},{"$f":"IF(OR(AC4=\"Térmico NC\",AC4=\"Térmico NO\"),\"THERM\",\"\")","v":""},null,null,"B"]
[null,{"$f":"calculator!AY6","v":""},{"$f":"calculator!AZ6","v":""},{"$f":"IFERROR(VLOOKUP(B15,calculator!$AE$2:$AG$58,3,FALSE),\"\")","v":""},{"$f":"IFERROR(VLOOKUP(B15,calculator!$AE$2:$AH$58,4,FALSE),\"\")","v":""},{"$f":"IFERROR(VLOOKUP(B15,calculator!$AE$2:$AL$58,8,FALSE),\"\")","v":""},{"$f":"IFERROR(VLOOKUP(B15,calculator!$AE$2:$AM$58,9,FALSE),\"\")","v":""},{"$f":"IFERROR(VLOOKUP(B15,calculator!AE6:AI62,5,FALSE),\"\")","v":""},{"$f":"IFERROR(VLOOKUP(B15,Precios!$A$2:$B$87,2,FALSE),\"\")","v":""},null,{"$f":"IFERROR(VLOOKUP(calculator!W6,calculator!$W$2:$W$47,1,FALSE),\"\")","v":""},null,{"$f":"IFERROR(VLOOKUP(K15,calculator!$B$5:$D$38,3,FALSE),\"\")","v":""},{"$f":"IFERROR(VLOOKUP(K15,calculator!$B$5:$F$38,5,FALSE),\"\")","v":""},{"$f":"IFERROR(VLOOKUP(K15,calculator!$B$5:$J$38,9,FALSE),\"\")","v":""},{"$f":"IFERROR(VLOOKUP(K15,calculator!$B$5:$C$38,2,FALSE),\"\")","v":""},{"$f":"IFERROR(VLOOKUP(K15,Precios!$A$2:$B$87,2,FALSE),\"\")","v":""},null,null,"Connectores de lectura: VS2600C1",null,null,null,null,null,null,"V5004TY10323000","V5004T1",null,null,null,null,"B"]
[null,{"$f":"calculator!AY7","v":""},{"$f":"calculator!AZ7","v":""},{"$f":"IFERROR(VLOOKUP(B16,calculator!$AE$2:$AG$58,3,FALSE),\"\")","v":""},{"$f":"IFERROR(VLOOKUP(B16,calculator!$AE$2:$AH$58,4,FALSE),\"\")","v":""},{"$f":"IFERROR(VLOOKUP(B16,calculator!$AE$2:$AL$58,8,FALSE),\"\")","v":""},{"$f":"IFERROR(VLOOKUP(B16,calculator!$AE$2:$AM$58,9,FALSE),\"\")","v":""},{"$f":"IFERROR(VLOOKUP(B16,calculator!AE7:AI63,5,FALSE),\"\")","v":""},{"$f":"IFERROR(VLOOKUP(B16,Precios!$A$2:$B$87,2,FALSE),\"\")","v":""},null,{"$f":"IFERROR(VLOOKUP(calculator!W7,calculator!$W$2:$W$47,1,FALSE),\"\")","v":""},null,{"$f":"IFERROR(VLOOKUP(K16,calculator!$B$5:$D$38,3,FALSE),\"\")","v":""},{"$f":"IFERROR(VLOOKUP(K16,calculator!$B$5:$F$38,5,FALSE),\"\")","v":""},{"$f":"IFERROR(VLOOKUP(K16,calculator!$B$5:$J$38,9,FALSE),\"\")","v":""},{"$f":"IFERROR(VLOOKUP(K16,calculator!$B$5:$C$38,2,FALSE),\"\")","v":""},{"$f":"IFERROR(VLOOKUP(K16,Precios!$A$2:$B$87,2,FALSE),\"\")","v":""},null,null,null,null,null,null,null,null,null,"V5004TY10326000","V5004T1",null,null,null,null,"R"]
[null,{"$f":"calculator!AY8","v":""},{"$f":"calculator!AZ8","v":""},{"$f":"IFERROR(VLOOKUP(B17,calculator!$AE$2:$AG$58,3,FALSE),\"\")","v":""},{"$f":"IFERROR(VLOOKUP(B17,calculator!$AE$2:$AH$58,4,FALSE),\"\")","v":""},{"$f":"IFERROR(VLOOKUP(B17,calculator!$AE$2:$AL$58,8,FALSE),\"\")","v":""},{"$f":"IFERROR(VLOOKUP(B17,calculator!$AE$2:$AM$58,9,FALSE),\"\")","v":""},{"$f":"IFERROR(VLOOKUP(B17,calculator!AE8:AI64,5,FALSE),\"\")","v":""},{"$f":"IFERROR(VLOOKUP(B17,Precios!$A$2:$B$87,2,FALSE),\"\")","v":""},null,{"$f":"IFERROR(VLOOKUP(calculator!W8,calculator!$W$2:$W$47,1,FALSE),\"\")","v":""},null,{"$f":"IFERROR(VLOOKUP(K17,calculator!$B$5:$D$38,3,FALSE),\"\")","v":""},{"$f":"IFERROR(VLOOKUP(K17,calculator!$B$5:$F$38,5,FALSE),\"\")","v":""},{"$f":"IFERROR(VLOOKUP(K17,calculator!$B$5:$J$38,9,FALSE),\"\")","v":""},{"$f":"IFERROR(VLOOKUP(K17,calculator!$B$5:$C$38,2,FALSE),\"\")","v":""},{"$f":"IFERROR(VLOOKUP(K17,Precios!$A$2:$B$87,2,FALSE),\"\")","v":""},null,null,null,null,null,null,null,null,null,"V5004TY10409000","V5004T2",null,null,null,null,"R"]
[null,{"$f":"calculator!AY9","v":""},{"$f":"calculator!AZ9","v":""},{"$f":"IFERROR(VLOOKUP(B18,calculator!$AE$2:$AG$58,3,FALSE),\"\")","v":""},{"$f":"IFERROR(VLOOKUP(B18,calculator!$AE$2:$AH$58,4,FALSE),\"\")","v":""},{"$f":"IFERROR(VLOOKUP(B18,calculator!$AE$2:$AL$58,8,FALSE),\"\")","v":""},{"$f":"IFERROR(VLOOKUP(B18,calculator!$AE$2:$AM$58,9,FALSE),\"\")","v":""},{"$f":"IFERROR(VLOOKUP(B18,calculator!AE9:AI65,5,FALSE),\"\")","v":""},{"$f":"IFERROR(VLOOKUP(B18,Precios!$A$2:$B$87,2,FALSE),\"\")","v":""},null,{"$f":"IFERROR(VLOOKUP(calculator!W9,calculator!$W$2:$W$47,1,FALSE),\"\")","v":""},null,{"$f":"IFERROR(VLOOKUP(K18,calculator!$B$5:$D$38,3,FALSE),\"\")","v":""},{"$f":"IFERROR(VLOOKUP(K18,calculator!$B$5:$F$38,5,FALSE),\"\")","v":""},{"$f":"IFERROR(VLOOKUP(K18,calculator!$B$5:$J$38,9,FALSE),\"\")","v":""},{"$f":"IFERROR(VLOOKUP(K18,calculator!$B$5:$C$38,2,FALSE),\"\")","v":""},{"$f":"IFERROR(VLOOKUP(K18,Precios!$A$2:$B$87,2,FALSE),\"\")","v":""},null,null,null,null,null,null,null,null,null,"V5004TY10501200","V5004T2",{"$f":"VLOOKUP($K$11,$AA$4:$AB$37,2,FALSE)","v":"V5004T1"},{"$f":"IF(AC18=\"V5004TF\",2,\"\")","v":""},null,null,"R"]
[null,{"$f":"calculator!AY10","v":""},{"$f":"calculator!AZ10","v":""},{"$f":"IFERROR(VLOOKUP(B19,calculator!$AE$2:$AG$58,3,FALSE),\"\")","v":""},{"$f":"IFERROR(VLOOKUP(B19,calculator!$AE$2:$AH$58,4,FALSE),\"\")","v":""},{"$f":"IFERROR(VLOOKUP(B19,calculator!$AE$2:$AL$58,8,FALSE),\"\")","v":""},{"$f":"IFERROR(VLOOKUP(B19,calculator!$AE$2:$AM$58,9,FALSE),\"\")","v":""},{"$f":"IFERROR(VLOOKUP(B19,calculator!AE10:AI66,5,FALSE),\"\")","v":""},{"$f":"IFERROR(VLOOKUP(B19,Precios!$A$2:$B$87,2,FALSE),\"\")","v":""},null,{"$f":"IFERROR(VLOOKUP(calculator!W10,calculator!$W$2:$W$47,1,FALSE),\"\")","v":""},null,{"$f":"IFERROR(VLOOKUP(K19,calculator!$B$5:$D$38,3,FALSE),\"\")","v":""},{"$f":"IFERROR(VLOOKUP(K19,calculator!$B$5:$F$38,5,FALSE),\"\")","v":""},{"$f":"IFERROR(VLOOKUP(K19,calculator!$B$5:$J$38,9,FALSE),\"\")","v":""},{"$f":"IFERROR(VLOOKUP(K19,calculator!$B$5:$C$38,2,FALSE),\"\")","v":""},{"$f":"IFERROR(VLOOKUP(K19,Precios!$A$2:$B$87,2,FALSE),\"\")","v":""},null,null,null,null,null,null,null,null,null,"V5004TY10501700","V5004T2",null,{"$f":"IF(AC18=\"V5004T2\",1,\"\")","v":""},null,null,"R"]
[null,{"$f":"calculator!AY11","v":""},{"$f":"calculator!AZ11","v":""},{"$f":"IFERROR(VLOOKUP(B20,calculator!$AE$2:$AG$58,3,FALSE),\"\")","v":""},{"$f":"IFERROR(VLOOKUP(B20,calculator!$AE$2:$AH$58,4,FALSE),\"\")","v":""},{"$f":"IFERROR(VLOOKUP(B20,calculator!$AE$2:$AL$58,8,FALSE),\"\")","v":""},{"$f":"IFERROR(VLOOKUP(B20,calculator!$AE$2:$AM$58,9,FALSE),\"\")","v":""},{"$f":"IFERROR(VLOOKUP(B20,calculator!AE11:AI67,5,FALSE),\"\")","v":""},{"$f":"IFERROR(VLOOKUP(B20,Precios!$A$2:$B$87,2,FALSE),\"\")","v":""},null,{"$f":"IFERROR(VLOOKUP(calculator!W11,calculator!$W$2:$W$47,1,FALSE),\"\")","v":""},null,{"$f":"IFERROR(VLOOKUP(K20,calculator!$B$5:$D$38,3,FALSE),\"\")","v":""}," ",{"$f":"IFERROR(VLOOKUP(K20,calculator!$B$5:$J$38,9,FALSE),\"\")","v":""},{"$f":"IFERROR(VLOOKUP(K20,calculator!$B$5:$C$38,2,FALSE),\"\")","v":""},{"$f":"IFERROR(VLOOKUP(K20,Precios!$A$2:$B$87,2,FALSE),\"\")","v":""},null,null,null,null,null,null,null,null,null,"V5004TF1050","V5004TF",null,null,null,null,"I"]
[null,{"$f":"calculator!AY12","v":""},{"$f":"calculator!AZ12","v":""},{"$f":"IFERROR(VLOOKUP(B21,calculator!$AE$2:$AG$58,3,FALSE),\"\")","v":""},{"$f":"IFERROR(VLOOKUP(B21,calculator!$AE$2:$AH$58,4,FALSE),\"\")","v":""},{"$f":"IFERROR(VLOOKUP(B21,calculator!$AE$2:$AL$58,8,FALSE),\"\")","v":""},{"$f":"IFERROR(VLOOKUP(B21,calculator!$AE$2:$AM$58,9,FALSE),\"\")","v":""},{"$f":"IFERROR(VLOOKUP(B21,calculator!AE12:AI68,5,FALSE),\"\")","v":""},{"$f":"IFERROR(VLOOKUP(B21,Precios!$A$2:$B$87,2,FALSE),\"\")","v":""},null,{"$f":"IFERROR(VLOOKUP(calculator!W12,calculator!$W$2:$W$47,1,FALSE),\"\")","v":""},null,{"$f":"IFERROR(VLOOKUP(K21,calculator!$B$5:$D$38,3,FALSE),\"\")","v":""},{"$f":"IFERROR(VLOOKUP(K21,calculator!$B$5:$F$38,5,FALSE),\"\")","v":""},{"$f":"IFERROR(VLOOKUP(K21,calculator!$B$5:$J$38,9,FALSE),\"\")","v":""},{"$f":"IFERROR(VLOOKUP(K21,calculator!$B$5:$C$38,2,FALSE),\"\")","v":""},{"$f":"IFERROR(VLOOKUP(K21,Precios!$A$2:$B$87,2,FALSE),\"\")","v":""},null,null,null,null,null,null,null,null,null,"V5004TF1065","V5004TF",null,null,null,null,"I"]
[null,{"$f":"calculator!AY13","v":""},{"$f":"calculator!AZ13","v":""},{"$f":"IFERROR(VLOOKUP(B22,calculator!$AE$2:$AG$58,3,FALSE),\"\")","v":""},{"$f":"IFERROR(VLOOKUP(B22,calculator!$AE$2:$AH$58,4,FALSE),\"\")","v":""},{"$f":"IFERROR(VLOOKUP(B22,calculator!$AE$2:$AL$58,8,FALSE),\"\")","v":""},{"$f":"IFERROR(VLOOKUP(B22,calculator!$AE$2:$AM$58,9,FALSE),\"\")","v":""},{"$f":"IFERROR(VLOOKUP(B22,calculator!AE13:AI69,5,FALSE),\"\")","v":""},{"$f":"IFERROR(VLOOKUP(B22,Precios!$A$2:$B$87,2,FALSE),\"\")","v":""},null,{"$f":"IFERROR(VLOOKUP(calculator!W13,calculator!$W$2:$W$47,1,FALSE),\"\")","v":""},null,{"$f":"IFERROR(VLOOKUP(K22,calculator!$B$5:$D$38,3,FALSE),\"\")","v":""},{"$f":"IFERROR(VLOOKUP(K22,calculator!$B$5:$F$38,5,FALSE),\"\")","v":""},{"$f":"IFERROR(VLOOKUP(K22,calculator!$B$5:$J$38,9,FALSE),\"\")","v":""},{"$f":"IFERROR(VLOOKUP(K22,calculator!$B$5:$C$38,2,FALSE),\"\")","v":""},{"$f":"IFERROR(VLOOKUP(K22,Precios!$A$2:$B$87,2,FALSE),\"\")","v":""},null,null,null,null,null,null,null,null,null,"V5004TF1080","V5004TF",null,null,null,null,"I"]
[null,"Observaciones:",null,null,null,null,null,{"$f":"IFERROR(VLOOKUP(B23,calculator!AE14:AI70,5,FALSE),\"\")","v":""},{"$f":"IFERROR(VLOOKUP(B23,Precios!$A$2:$B$87,2,FALSE),\"\")","v":""},null,{"$f":"IFERROR(VLOOKUP(calculator!W14,calculator!$W$2:$W$47,1,FALSE),\"\")","v":""},null,{"$f":"IFERROR(VLOOKUP(K23,calculator!$B$5:$D$38,3,FALSE),\"\")","v":""},{"$f":"IFERROR(VLOOKUP(K23,calculator!$B$5:$F$38,5,FALSE),\"\")","v":""},{"$f":"IFERROR(VLOOKUP(K23,calculator!$B$5:$J$38,9,FALSE),\"\")","v":""},{"$f":"IFERROR(VLOOKUP(K23,calculator!$B$5:$C$38,2,FALSE),\"\")","v":""},{"$f":"IFERROR(VLOOKUP(K23,Precios!$A$2:$B$87,2,FALSE),\"\")","v":""},null,null,null,null,null,null,null,null,null,"V5004TF1100","V5004TF",null,null,null,null,"I"]
[null,{"$f":"IFERROR(IF(AND(AD14=\"THERM\",AH4=\"R\"),\"Seleccione tipo Motor\",\"\"),\"\")","v":""},null,null,null,null,{"$f":"(IF(AD4=\"2Pt, 3Pt\",\"Actuador: motor =3Pt, térmico =2PT\",\"\"))","v":""},null,null,null,{"$f":"IFERROR(VLOOKUP(calculator!W15,calculator!$W$2:$W$47,1,FALSE),\"\")","v":""},null,{"$f":"IFERROR(VLOOKUP(K24,calculator!$B$5:$D$38,3,FALSE),\"\")","v":""},{"$f":"IFERROR(VLOOKUP(K24,calculator!$B$5:$F$38,5,FALSE),\"\")","v":""},{"$f":"IFERROR(VLOOKUP(K24,calculator!$B$5:$J$38,9,FALSE),\"\")","v":""},{"$f":"IFERROR(VLOOKUP(K24,calculator!$B$5:$C$38,2,FALSE),\"\")","v":""},{"$f":"IFERROR(VLOOKUP(K24,Precios!$A$2:$B$87,2,FALSE),\"\")","v":""},null,null,null,null,null,null,null,null,null,"V5004TF1125","V5004TF",null,null,null,null,"I"]
[null,{"$f":"IF(AD18=2,\"Seleccionable 2pt, PWM, 4-20mA Actuador incluido\",\"Actuador no incluido\")","v":"Actuador no incluido"},null,null,null,null,null,null,null,null,{"$f":"IFERROR(VLOOKUP(calculator!W16,calculator!$W$2:$W$47,1,FALSE),\"\")","v":""},null,{"$f":"IFERROR(VLOOKUP(K25,calculator!$B$5:$D$38,3,FALSE),\"\")","v":""},{"$f":"IFERROR(VLOOKUP(K25,calculator!$B$5:$F$38,5,FALSE),\"\")","v":""},{"$f":"IFERROR(VLOOKUP(K25,calculator!$B$5:$J$38,9,FALSE),\"\")","v":""},{"$f":"IFERROR(VLOOKUP(K25,calculator!$B$5:$C$38,2,FALSE),\"\")","v":""},{"$f":"IFERROR(VLOOKUP(K25,Precios!$A$2:$B$87,2,FALSE),\"\")","v":""},null,null,null,null,null,null,null,null,null,"V5004TF1150","V5004TF",null,null,null,null,"I"]
[null,{"$f":"IF(AND(AC4=\"accion rápido\",B11=\"\"),\"selecione tipo Motor\",\"\")","v":""},null,null,null,null,null,null,null,null,{"$f":"IFERROR(VLOOKUP(calculator!W17,calculator!$W$2:$W$47,1,FALSE),\"\")","v":""},null,null,null,null,null,null,null,null,"Vávlvula de drenaje: VA3401A008",null,null,null,null,null,null,"V5005TY10150350","V5005T1",null,null,null,null,"A"]
[null,{"$f":"IF(AND(AD14=\"THERM\",AD4=\"0…10V\"),\"Para 0…10V selecione tipo Motor\",\"\")","v":""},null,null,null,null,null,null,null,null,null,null,{"$f":"IFERROR(VLOOKUP(K27,[1]Valves!B24:D57,3,FALSE),\"\")","v":""},{"$f":"IFERROR(VLOOKUP(K27,[1]Valves!B24:F57,5,FALSE),\"\")","v":""},{"$f":"IFERROR(VLOOKUP(K27,[1]Valves!B24:J57,9,FALSE),\"\")","v":""},{"$f":"IFERROR(VLOOKUP(K27,[1]Valves!B24:C57,2,FALSE),\"\")","v":""},null,null,null,null,null,null,null,null,null,null,"V5005TY10151000","V5005T1",null,null,null,null,"A"]
[null,null,null,null,null,null,null,null,null,null,null,null,null,null,null,null,null,null,null,null,null,null,null,null,null,null,"V5005TY10201000","V5005T1",null,null,null,null,"A"]
[null,"Cómo usar el selector? ",null,null,null,null,null,null,null,null,null,null,null,null,null,null,null,null,null,null,null,null,null,null,null,null,"V5005TY10201500","V5005T1",null,null,null,null,"A"]
[null,"Introduzca el caudal deseado. Después seleccione el tipo de actuador y el método de control, y rellene los precios en la hoja de precios.",null,null,null,null,null,null,null,null,null,null,null,null,null,null,null,null,null,null,null,null,null,null,null,null,"V5005TY10251000","V5005T1",null,null,null,null,"A"]
[null,null,null,null,null,null,null,null,null,null,null,null,null,null,null,null,null,null,null,null,null,null,null,null,null,null,"V5005TY10251500","V5005T1",null,null,null,null,"A"]
[null,null,null,null,null,null,null,null,null,null,null,null,null,null,null,null,null,null,null,null,null,null,null,null,null,null,"V5005TY20150350","V5005T2",null,null,null,null,"A"]
[null,null,null,null,null,null,null,null,null,null,null,null,null,null,null,null,null,null,null,null,null,null,null,null,null,null,"V5005TY20151000","V5005T2",null,null,null,null,"A"]
[null,null,null,null,null,null,null,null,null,null,null,null,null,null,null,null,null,null,null,null,null,null,null,null,null,null,"V5005TY20201000","V5005T2",null,null,null,null,"A"]
[null,null,null,null,null,null,null,null,null,null,null,null,null,null,null,null,null,null,null,null,null,null,null,null,null,null,"V5005TY20201500","V5005T2",null,null,null,null,"A"]
[null,null,null,null,null,null,null,null,null,null,null,null,null,null,null,null,null,null,null,null,null,null,null,null,null,null,"V5005TY20251000","V5005T2",null,null,null,null,"A"]
[null,null,null,null,null,null,null,null,null,null,null,null,null,null,null,null,null,null,null,null,null,null,null,null,null,null,"V5005TY20251500","V5005T2",null,null,null,null,"A"]
[null,"Hoja de datos :"]
[null,"                      V5004","https://products.ecc.emea.honeywell.com/europe/pdf/v5004t-pd-en0h2327ge23r0318.pdf "]
[null,"                      V5005","https://products.ecc.emea.honeywell.com/europe/pdf/v5005t-pd-en0h2329ge23r0318.pdf "]

{"sheet":"calculator","index":1,"n_rows":58,"n_cols":52,"rows_kept":58,"cut":false,"hidden":true,"merged":[]}
[null,"Part Nbr.","safe cons","Min flow rate\nl/h","Recom  Min flow ","Max flow rate\nl/h","Recom  Max flow ","Countif helper","Average flow","DN","Stroke mm","Actuator type","Stroke class PICV","Number Helper","Part Nbr.","Average flow","Valid nbr column J","Helper3","Matching  parts","Ranking","Recommended parts",null,"Parts","Safecon check valves","Min flow","Max flow","DN size","Valve type ","Price",null,"Part","Stroke mm","Powerless action","Voltage","Cable length","Action help","Action","End switch ","Runtime Sec","Helper1\n number","Helper2 identiy Typ","Helper 3 consolid type","Helper 2 identify action2",null,"List of parts","Helper 3 consolid type","Helper stroke valve",null,"Helper3",null,"Part number"]
[null,null,null,null,null,null,null,null,null,null,null,null,null,null,null,null,null,null,null,1,{"$f":"IFERROR(VLOOKUP($X$11&\":\"&T2,$H$5:$O$38,7,FALSE),\"\")","v":1},null,{"$f":"IFERROR(INDEX($B$5:$B$38,$U2,1),\"\")","v":"V5004TY10150150"},{"$f":"IFERROR(VLOOKUP(W2,$B$5:$C$38,2,FALSE),\"\")","v":"Si"},{"$f":"IFERROR(VLOOKUP(W2,B5:$D$38,3,FALSE),\"\")","v":45},{"$f":"IFERROR(VLOOKUP(W2,$B$5:$F$38,5,FALSE),\"\")","v":150},{"$f":"IFERROR(VLOOKUP(W2,B5:$J$38,9,FALSE),\"\")","v":15},{"$f":"IFERROR(VLOOKUP(W2,B5:$M$38,12,FALSE),\"\")","v":"A"},null,"Térmico NO","MT4-024-NO",4,"Abre","24Vac/dc",1,"2Pt, 3Pt","A","no",240,1,{"$f":"IF(AND($X$12=AD2,AK2=AB$2),AN2,\"\")","v":""},{"$f":"IFERROR(SMALL($AO$2:$AO$58,ROWS($AO$2:AO2)),\"\")","v":""},{"$f":"IFERROR(VLOOKUP(AS2,$AE$2:$AK$58,6,FALSE),\"\")","v":""},null,{"$f":"IFERROR(INDEX($AE$2:$AK$58,$AP2,COLUMNS($AR$2:AR2)),\"\")","v":""},{"$f":"IFERROR(SMALL($AO$2:$AO$58,ROWS($AO$2:AS2)),\"\")","v":""},{"$f":"IFERROR(VLOOKUP(AS2,$AE$2:$AJ$58,6,FALSE),\"\")","v":""},{"$f":"IF($X$13=AU2,AT2,\"\")","v":""},{"$f":"IFERROR(SMALL($AV$2:$AV$58,ROWS($F$4:F4)),\"\")","v":""},null,{"$f":"IFERROR(INDEX($AE$2:$AM$58,$AW2,COLUMNS($AX$2:AX2)),\"\")","v":""},{"$f":"IFERROR(VLOOKUP(AY2,AE2:$AF$58,2,FALSE),\"\")","v":""}]
[null,null,null,null,null,null,null,null,null,null,null,null,null,null,null,null,null,null,null,2,"",null,{"$f":"IFERROR(INDEX($B$5:$B$38,$U3,1),\"\")","v":""},{"$f":"IFERROR(VLOOKUP(W3,$B$5:$C$38,2,FALSE),\"\")","v":""},{"$f":"IFERROR(VLOOKUP(W3,B6:$D$38,3,FALSE),\"\")","v":""},{"$f":"IFERROR(VLOOKUP(W3,$B$5:$F$38,5,FALSE),\"\")","v":""},{"$f":"IFERROR(VLOOKUP(W3,B6:$J$38,9,FALSE),\"\")","v":""},{"$f":"IFERROR(VLOOKUP(W3,B6:$M$38,12,FALSE),\"\")","v":""},null,"Térmico NO","MT4-024-NO-2.5M",4,"Abre","24Vac/dc",2.5,"2Pt, 3Pt","A","no",240,2,{"$f":"IF(AND($X$12=AD3,AK3=AB$2),AN3,\"\")","v":""},{"$f":"IFERROR(SMALL($AO$2:$AO$58,ROWS($AO$2:AO3)),\"\")","v":""},"",null,{"$f":"IFERROR(INDEX($AE$2:$AK$58,$AP3,COLUMNS($AR$2:AR3)),\"\")","v":""},{"$f":"IFERROR(SMALL($AO$2:$AO$58,ROWS($AO$2:AS3)),\"\")","v":""},{"$f":"IFERROR(VLOOKUP(AS3,$AE$2:$AJ$58,6,FALSE),\"\")","v":""},{"$f":"IF($X$13=AU3,AT3,\"\")","v":""},{"$f":"IFERROR(SMALL($AV$2:$AV$58,ROWS($F$4:F5)),\"\")","v":""},null,{"$f":"IFERROR(INDEX($AE$2:$AM$58,$AW3,COLUMNS($AX$2:AX3)),\"\")","v":""},{"$f":"IFERROR(VLOOKUP(AY3,AE3:$AF$58,2,FALSE),\"\")","v":""}]
[null,null,null,null,null,null,null,null,null,null,null,null,null,null,null,null,null,null,null,3,"",null,"","",{"$f":"IFERROR(VLOOKUP(W4,B7:$D$38,3,FALSE),\"\")","v":""},"",{"$f":"IFERROR(VLOOKUP(W4,B7:$J$38,9,FALSE),\"\")","v":""},{"$f":"IFERROR(VLOOKUP(W4,B7:$M$38,12,FALSE),\"\")","v":""},null,"Térmico NO","MT4-024S-NO",4,"Abre","24Vac/dc",1,"2Pt, 3Pt","A",1,240,3,"",{"$f":"IFERROR(SMALL($AO$2:$AO$58,ROWS($AO$2:AO4)),\"\")","v":""},"",null,{"$f":"IFERROR(INDEX($AE$2:$AK$58,$AP4,COLUMNS($AR$2:AR4)),\"\")","v":""},{"$f":"IFERROR(SMALL($AO$2:$AO$58,ROWS($AO$2:AS4)),\"\")","v":""},"",{"$f":"IF($X$13=AU4,AT4,\"\")","v":""},{"$f":"IFERROR(SMALL($AV$2:$AV$58,ROWS($F$4:F6)),\"\")","v":""},null,{"$f":"IFERROR(INDEX($AE$2:$AM$58,$AW4,COLUMNS($AX$2:AX4)),\"\")","v":""},{"$f":"IFERROR(VLOOKUP(AY4,AE4:$AF$58,2,FALSE),\"\")","v":""}]
["V5004T1","V5004TY10150150","Si",45,58.5,150,{"$f":"F5*0.85","v":127.5},{"$f":"I5&\":\"&COUNTIF($I$5:I5,I5)","v":"93:1"},{"$f":"IFERROR((E5+G5)/2,0)","v":93},15,2.9,"Linear","A",1,{"$f":"IF(AND($X$10>E5,$X$10<G5),B5,\"\")","v":""},{"$f":"IF(O5=B5,I5,\"\")","v":""},{"$f":"IF(O5=B5,N5,\"\")","v":""},{"$f":"IFERROR(SMALL($Q$5:$Q$38,ROWS(Q$5:$Q5)),\"\")","v":""},{"$f":"IFERROR(INDEX($B$5:$N$38,$R5,COLUMNS($B$5:B5)),\"\")","v":""},4,"",null,"","",{"$f":"IFERROR(VLOOKUP(W5,B8:$D$38,3,FALSE),\"\")","v":""},"",{"$f":"IFERROR(VLOOKUP(W5,B8:$J$38,9,FALSE),\"\")","v":""},{"$f":"IFERROR(VLOOKUP(W5,B8:$M$38,12,FALSE),\"\")","v":""},{"$f":"A5","v":"V5004T1"},"Térmico NC","MT4-024-NC",4,"Cierra","24Vac/dc",1,"2Pt, 3Pt","A","no",240,4,"",{"$f":"IFERROR(SMALL($AO$2:$AO$58,ROWS($AO$2:AO5)),\"\")","v":""},"",null,{"$f":"IFERROR(INDEX($AE$2:$AK$58,$AP5,COLUMNS($AR$2:AR5)),\"\")","v":""},{"$f":"IFERROR(SMALL($AO$2:$AO$58,ROWS($AO$2:AS5)),\"\")","v":""},"","",{"$f":"IFERROR(SMALL($AV$2:$AV$58,ROWS($F$4:F7)),\"\")","v":""},null,{"$f":"IFERROR(INDEX($AE$2:$AM$58,$AW5,COLUMNS($AX$2:AX5)),\"\")","v":""},{"$f":"IFERROR(VLOOKUP(AY5,AE5:$AF$58,2,FALSE),\"\")","v":""}]
["V5004T1","V5004TY10150600","Si",60,78,600,{"$f":"F6*0.85","v":510},{"$f":"I6&\":\"&COUNTIF($I$5:I6,I6)","v":"294:1"},294,15,2.9,"Linear","A",2,"","","",{"$f":"IFERROR(SMALL($Q$5:$Q$38,ROWS(Q$5:$Q6)),\"\")","v":""},{"$f":"IFERROR(INDEX($B$5:$N$38,$R6,COLUMNS($B$5:B6)),\"\")","v":""},5,"",null,"","",{"$f":"IFERROR(VLOOKUP(W6,B9:$D$38,3,FALSE),\"\")","v":""},"",{"$f":"IFERROR(VLOOKUP(W6,B9:$J$38,9,FALSE),\"\")","v":""},{"$f":"IFERROR(VLOOKUP(W6,B9:$M$38,12,FALSE),\"\")","v":""},{"$f":"A6","v":"V5004T1"},"Térmico NC","MT4-024-NC-2.5M",4,"Cierra","24Vac/dc",2.5,"2Pt, 3Pt","A","no",240,5,"",{"$f":"IFERROR(SMALL($AO$2:$AO$58,ROWS($AO$2:AO6)),\"\")","v":""},"",null,{"$f":"IFERROR(INDEX($AE$2:$AK$58,$AP6,COLUMNS($AR$2:AR6)),\"\")","v":""},{"$f":"IFERROR(SMALL($AO$2:$AO$58,ROWS($AO$2:AS6)),\"\")","v":""},"","",{"$f":"IFERROR(SMALL($AV$2:$AV$58,ROWS($F$4:F8)),\"\")","v":""},null,{"$f":"IFERROR(INDEX($AE$2:$AM$58,$AW6,COLUMNS($AX$2:AX6)),\"\")","v":""},{"$f":"IFERROR(VLOOKUP(AY6,AE6:$AF$58,2,FALSE),\"\")","v":""}]
["V5004T1","V5004TY10150780","Si",78,101.4,780,663,{"$f":"I7&\":\"&COUNTIF($I$5:I7,I7)","v":"382.2:1"},382.2,15,2.9,"Linear","A",3,"","","",{"$f":"IFERROR(SMALL($Q$5:$Q$38,ROWS(Q$5:$Q7)),\"\")","v":""},{"$f":"IFERROR(INDEX($B$5:$N$38,$R7,COLUMNS($B$5:B7)),\"\")","v":""},6,"",null,"","",{"$f":"IFERROR(VLOOKUP(W7,B10:$D$38,3,FALSE),\"\")","v":""},"",{"$f":"IFERROR(VLOOKUP(W7,B10:$J$38,9,FALSE),\"\")","v":""},{"$f":"IFERROR(VLOOKUP(W7,B10:$M$38,12,FALSE),\"\")","v":""},"V5004T1","Térmico NC","MT4-024S-NC",4,"Cierra","24Vac/dc",1,"2Pt, 3Pt","A",1,240,6,"",{"$f":"IFERROR(SMALL($AO$2:$AO$58,ROWS($AO$2:AO7)),\"\")","v":""},"",null,{"$f":"IFERROR(INDEX($AE$2:$AK$58,$AP7,COLUMNS($AR$2:AR7)),\"\")","v":""},{"$f":"IFERROR(SMALL($AO$2:$AO$58,ROWS($AO$2:AS7)),\"\")","v":""},"","",{"$f":"IFERROR(SMALL($AV$2:$AV$58,ROWS($F$4:F9)),\"\")","v":""},null,{"$f":"IFERROR(INDEX($AE$2:$AM$58,$AW7,COLUMNS($AX$2:AX7)),\"\")","v":""},{"$f":"IFERROR(VLOOKUP(AY7,AE7:$AF$58,2,FALSE),\"\")","v":""}]
["V5004T1","V5004TY10201000","Si",100,130,1000,850,{"$f":"I8&\":\"&COUNTIF($I$5:I8,I8)","v":"490:1"},490,20,2.9,"Linear","A",4,"","","",{"$f":"IFERROR(SMALL($Q$5:$Q$38,ROWS(Q$5:$Q8)),\"\")","v":""},{"$f":"IFERROR(INDEX($B$5:$N$38,$R8,COLUMNS($B$5:B8)),\"\")","v":""},7,"",null,"","",{"$f":"IFERROR(VLOOKUP(W8,B11:$D$38,3,FALSE),\"\")","v":""},"",{"$f":"IFERROR(VLOOKUP(W8,B11:$J$38,9,FALSE),\"\")","v":""},{"$f":"IFERROR(VLOOKUP(W8,B11:$M$38,12,FALSE),\"\")","v":""},"V5004T1","Térmico NO","MT4-230-NO",4,"Abre","230Vac",1,"2Pt, 3Pt","A","no",240,7,"",{"$f":"IFERROR(SMALL($AO$2:$AO$58,ROWS($AO$2:AO8)),\"\")","v":""},"",null,{"$f":"IFERROR(INDEX($AE$2:$AK$58,$AP8,COLUMNS($AR$2:AR8)),\"\")","v":""},{"$f":"IFERROR(SMALL($AO$2:$AO$58,ROWS($AO$2:AS8)),\"\")","v":""},"","",{"$f":"IFERROR(SMALL($AV$2:$AV$58,ROWS($F$4:F10)),\"\")","v":""},null,{"$f":"IFERROR(INDEX($AE$2:$AM$58,$AW8,COLUMNS($AX$2:AX8)),\"\")","v":""},{"$f":"IFERROR(VLOOKUP(AY8,AE8:$AF$58,2,FALSE),\"\")","v":""}]
["V5004T1","V5004TY10201500","Si",450,585,1500,1275,{"$f":"I9&\":\"&COUNTIF($I$5:I9,I9)","v":"930:1"},930,20,2.9,"Linear","A",5,"","","",{"$f":"IFERROR(SMALL($Q$5:$Q$38,ROWS(Q$5:$Q9)),\"\")","v":""},{"$f":"IFERROR(INDEX($B$5:$N$38,$R9,COLUMNS($B$5:B9)),\"\")","v":""},null,null,null,null,null,{"$f":"IFERROR(VLOOKUP(U12,B12:D45,3,FALSE),\"\")","v":""},{"$f":"IFERROR(VLOOKUP(U12,B12:L45,5,FALSE),\"\")","v":""},{"$f":"IFERROR(VLOOKUP(U12,B12:L45,9,FALSE),\"\")","v":""},null,"V5004T1","Térmico NO","MT4-230-NO-2.5M",4,"Abre","230Vac",2.5,"2Pt, 3Pt","A","no",240,8,"",{"$f":"IFERROR(SMALL($AO$2:$AO$58,ROWS($AO$2:AO9)),\"\")","v":""},"",null,{"$f":"IFERROR(INDEX($AE$2:$AK$58,$AP9,COLUMNS($AR$2:AR9)),\"\")","v":""},{"$f":"IFERROR(SMALL($AO$2:$AO$58,ROWS($AO$2:AS9)),\"\")","v":""},"","",{"$f":"IFERROR(SMALL($AV$2:$AV$58,ROWS($F$4:F11)),\"\")","v":""},null,{"$f":"IFERROR(INDEX($AE$2:$AM$58,$AW9,COLUMNS($AX$2:AX9)),\"\")","v":""},{"$f":"IFERROR(VLOOKUP(AY9,AE9:$AF$58,2,FALSE),\"\")","v":""}]
["V5004T1","V5004TY10251500","Si",450,585,1500,1275,{"$f":"I10&\":\"&COUNTIF($I$5:I10,I10)","v":"930:2"},930,25,2.9,"Linear","A",6,"","","",{"$f":"IFERROR(SMALL($Q$5:$Q$38,ROWS(Q$5:$Q10)),\"\")","v":""},{"$f":"IFERROR(INDEX($B$5:$N$38,$R10,COLUMNS($B$5:B10)),\"\")","v":""},null,0,null,null,{"$f":"Español!P7","v":0},{"$f":"IFERROR(VLOOKUP(U13,B13:D46,3,FALSE),\"\")","v":""},{"$f":"IFERROR(VLOOKUP(U13,B13:L46,5,FALSE),\"\")","v":""},{"$f":"IFERROR(VLOOKUP(U13,B13:L46,9,FALSE),\"\")","v":""},null,"V5004T1","Térmico NO","MT4-230S-NO",4,"Abre","230Vac",1,"2Pt, 3Pt","A",1,240,9,"",{"$f":"IFERROR(SMALL($AO$2:$AO$58,ROWS($AO$2:AO10)),\"\")","v":""},"",null,{"$f":"IFERROR(INDEX($AE$2:$AK$58,$AP10,COLUMNS($AR$2:AR10)),\"\")","v":""},{"$f":"IFERROR(SMALL($AO$2:$AO$58,ROWS($AO$2:AS10)),\"\")","v":""},"","",{"$f":"IFERROR(SMALL($AV$2:$AV$58,ROWS($F$4:F12)),\"\")","v":""},null,{"$f":"IFERROR(INDEX($AE$2:$AM$58,$AW10,COLUMNS($AX$2:AX10)),\"\")","v":""},{"$f":"IFERROR(VLOOKUP(AY10,AE10:$AF$58,2,FALSE),\"\")","v":""}]
["V5004T1","V5004TY10202200","Si",220,286,2200,1870,{"$f":"I11&\":\"&COUNTIF($I$5:I11,I11)","v":"1078:1"},1078,20,6,"Linear","B",7,"","","",{"$f":"IFERROR(SMALL($Q$5:$Q$38,ROWS(Q$5:$Q11)),\"\")","v":""},{"$f":"IFERROR(INDEX($B$5:$N$38,$R11,COLUMNS($B$5:B11)),\"\")","v":""},null,"Closest flow l/h",null,null,{"$f":"INDEX(I5:I38,MATCH(MIN(ABS(I5:I38-X10)),ABS(I5:I38-X10),0))","v":93},{"$f":"IFERROR(VLOOKUP(U14,B14:D47,3,FALSE),\"\")","v":""},{"$f":"IFERROR(VLOOKUP(U14,B14:L47,5,FALSE),\"\")","v":""},{"$f":"IFERROR(VLOOKUP(U14,B14:L47,9,FALSE),\"\")","v":""},null,"V5004T1","Térmico NC","MT4-230-NC",4,"Cierra","230Vac",1,"2Pt, 3Pt","A","no",240,10,"",{"$f":"IFERROR(SMALL($AO$2:$AO$58,ROWS($AO$2:AO11)),\"\")","v":""},"",null,{"$f":"IFERROR(INDEX($AE$2:$AK$58,$AP11,COLUMNS($AR$2:AR11)),\"\")","v":""},{"$f":"IFERROR(SMALL($AO$2:$AO$58,ROWS($AO$2:AS11)),\"\")","v":""},"","",{"$f":"IFERROR(SMALL($AV$2:$AV$58,ROWS($F$4:F13)),\"\")","v":""},null,{"$f":"IFERROR(INDEX($AE$2:$AM$58,$AW11,COLUMNS($AX$2:AX11)),\"\")","v":""},{"$f":"IFERROR(VLOOKUP(AY11,AE11:$AF$58,2,FALSE),\"\")","v":""}]
["V5004T1","V5004TY10202700","Si",270,351,2700,2295,{"$f":"I12&\":\"&COUNTIF($I$5:I12,I12)","v":"1323:1"},1323,20,6,"Linear","B",8,"","","",{"$f":"IFERROR(SMALL($Q$5:$Q$38,ROWS(Q$5:$Q12)),\"\")","v":""},{"$f":"IFERROR(INDEX($B$5:$N$38,$R12,COLUMNS($B$5:B12)),\"\")","v":""},null,"Type of actuator:",null,null,{"$f":"Español!AC4","v":"Ninguno"},{"$f":"IFERROR(VLOOKUP(#REF!,B15:D48,3,FALSE),\"\")","v":""},{"$f":"IFERROR(VLOOKUP(#REF!,B15:L48,5,FALSE),\"\")","v":""},{"$f":"IFERROR(VLOOKUP(#REF!,B15:L48,9,FALSE),\"\")","v":""},null,"V5004T1","Térmico NC","MT4-230-NC-2.5M",4,"Cierra","230Vac",2.5,"2Pt, 3Pt","A","no",240,11,"",{"$f":"IFERROR(SMALL($AO$2:$AO$58,ROWS($AO$2:AO12)),\"\")","v":""},"",null,{"$f":"IFERROR(INDEX($AE$2:$AK$58,$AP12,COLUMNS($AR$2:AR12)),\"\")","v":""},{"$f":"IFERROR(SMALL($AO$2:$AO$58,ROWS($AO$2:AS12)),\"\")","v":""},"","",{"$f":"IFERROR(SMALL($AV$2:$AV$58,ROWS($F$4:F14)),\"\")","v":""},null,{"$f":"IFERROR(INDEX($AE$2:$AM$58,$AW12,COLUMNS($AX$2:AX12)),\"\")","v":""},{"$f":"IFERROR(VLOOKUP(AY12,AE12:$AF$58,2,FALSE),\"\")","v":""}]
["V5004T1","V5004TY10252200","Si",220,286,2200,1870,{"$f":"I13&\":\"&COUNTIF($I$5:I13,I13)","v":"1078:2"},1078,25,6,"Linear","B",9,"","","",{"$f":"IFERROR(SMALL($Q$5:$Q$38,ROWS(Q$5:$Q13)),\"\")","v":""},{"$f":"IFERROR(INDEX($B$5:$N$38,$R13,COLUMNS($B$5:B13)),\"\")","v":""},null,"Signal",null,null,{"$f":"Español!AD4","v":"----"},{"$f":"IFERROR(VLOOKUP(#REF!,B16:D49,3,FALSE),\"\")","v":""},{"$f":"IFERROR(VLOOKUP(#REF!,B16:L49,5,FALSE),\"\")","v":""},{"$f":"IFERROR(VLOOKUP(#REF!,B16:L49,9,FALSE),\"\")","v":""},null,"V5004T1","Térmico NC","MT4-230S-NC",4,"Cierra","230Vac",1,"2Pt, 3Pt","A",1,240,12,"",{"$f":"IFERROR(SMALL($AO$2:$AO$58,ROWS($AO$2:AO13)),\"\")","v":""},"",null,{"$f":"IFERROR(INDEX($AE$2:$AK$58,$AP13,COLUMNS($AR$2:AR13)),\"\")","v":""},{"$f":"IFERROR(SMALL($AO$2:$AO$58,ROWS($AO$2:AS13)),\"\")","v":""},"","",{"$f":"IFERROR(SMALL($AV$2:$AV$58,ROWS($F$4:F15)),\"\")","v":""},null,{"$f":"IFERROR(INDEX($AE$2:$AM$58,$AW13,COLUMNS($AX$2:AX13)),\"\")","v":""},{"$f":"IFERROR(VLOOKUP(AY13,AE13:$AF$58,2,FALSE),\"\")","v":""}]
["V5004T1","V5004TY10252700","Si",270,351,3000,2550,{"$f":"I14&\":\"&COUNTIF($I$5:I14,I14)","v":"1450.5:1"},1450.5,25,6,"Linear","B",10,"","","",{"$f":"IFERROR(SMALL($Q$5:$Q$38,ROWS(Q$5:$Q14)),\"\")","v":""},{"$f":"IFERROR(INDEX($B$5:$N$38,$R14,COLUMNS($B$5:B14)),\"\")","v":""},null,"Action",null,null,{"$f":"IF(X12=\"Therm NC\",\"Close\",IF(X12=\"Therm NO\",\"Open\",\"\"))","v":""},{"$f":"IFERROR(VLOOKUP(#REF!,B17:D50,3,FALSE),\"\")","v":""},{"$f":"IFERROR(VLOOKUP(#REF!,B17:L50,5,FALSE),\"\")","v":""},{"$f":"IFERROR(VLOOKUP(#REF!,B17:L50,9,FALSE),\"\")","v":""},null,"V5004T1","Térmico NO","MT8-024-NO",8,"Abre","24Vac/dc",1,"2Pt, 3Pt","B","no",360,13,"",{"$f":"IFERROR(SMALL($AO$2:$AO$58,ROWS($AO$2:AO14)),\"\")","v":""},"",null,{"$f":"IFERROR(INDEX($AE$2:$AK$58,$AP14,COLUMNS($AR$2:AR14)),\"\")","v":""},{"$f":"IFERROR(SMALL($AO$2:$AO$58,ROWS($AO$2:AS14)),\"\")","v":""},"","",{"$f":"IFERROR(SMALL($AV$2:$AV$58,ROWS($F$4:F16)),\"\")","v":""},null,{"$f":"IFERROR(INDEX($AE$2:$AM$58,$AW14,COLUMNS($AX$2:AX14)),\"\")","v":""},{"$f":"IFERROR(VLOOKUP(AY14,AE14:$AF$58,2,FALSE),\"\")","v":""}]
["V5004T1","V5004TY10322700","Si",270,351,3000,2550,{"$f":"I15&\":\"&COUNTIF($I$5:I15,I15)","v":"1450.5:2"},1450.5,32,6,"Linear","B",11,"","","",{"$f":"IFERROR(SMALL($Q$5:$Q$38,ROWS(Q$5:$Q15)),\"\")","v":""},{"$f":"IFERROR(INDEX($B$5:$N$38,$R15,COLUMNS($B$5:B15)),\"\")","v":""},null,"List of actuators",null,null,null,{"$f":"IFERROR(VLOOKUP(U15,B18:D51,3,FALSE),\"\")","v":""},{"$f":"IFERROR(VLOOKUP(U15,B18:L51,5,FALSE),\"\")","v":""},{"$f":"IFERROR(VLOOKUP(U15,B18:L51,9,FALSE),\"\")","v":""},null,"V5004T1","Térmico NO","MT8-024-NO-2.5M",8,"Abre","24Vac/dc",2.5,"2Pt, 3Pt","B","no",360,14,"",{"$f":"IFERROR(SMALL($AO$2:$AO$58,ROWS($AO$2:AO15)),\"\")","v":""},"",null,{"$f":"IFERROR(INDEX($AE$2:$AK$58,$AP15,COLUMNS($AR$2:AR15)),\"\")","v":""},{"$f":"IFERROR(SMALL($AO$2:$AO$58,ROWS($AO$2:AS15)),\"\")","v":""},"","",{"$f":"IFERROR(SMALL($AV$2:$AV$58,ROWS($F$4:F17)),\"\")","v":""},null,{"$f":"IFERROR(INDEX($AE$2:$AM$58,$AW15,COLUMNS($AX$2:AX15)),\"\")","v":""},{"$f":"IFERROR(VLOOKUP(AY15,AE15:$AF$58,2,FALSE),\"\")","v":""}]
["V5004T1","V5004TY10323000","Si",300,390,3000,2550,{"$f":"I16&\":\"&COUNTIF($I$5:I16,I16)","v":"1470:1"},1470,32,6,"Linear","B",12,"","","",{"$f":"IFERROR(SMALL($Q$5:$Q$38,ROWS(Q$5:$Q16)),\"\")","v":""},{"$f":"IFERROR(INDEX($B$5:$N$38,$R16,COLUMNS($B$5:B16)),\"\")","v":""},null,null,null,null,null,"","","",null,"V5004T1","Térmico NO","MT8-024S-NO",8,"Abre","24Vac/dc",1,"2Pt, 3Pt","B",1,360,15,"",{"$f":"IFERROR(SMALL($AO$2:$AO$58,ROWS($AO$2:AO16)),\"\")","v":""},"",null,{"$f":"IFERROR(INDEX($AE$2:$AK$58,$AP16,COLUMNS($AR$2:AR16)),\"\")","v":""},{"$f":"IFERROR(SMALL($AO$2:$AO$58,ROWS($AO$2:AS16)),\"\")","v":""},"","",{"$f":"IFERROR(SMALL($AV$2:$AV$58,ROWS($F$4:F18)),\"\")","v":""},null,{"$f":"IFERROR(INDEX($AE$2:$AM$58,$AW16,COLUMNS($AX$2:AX16)),\"\")","v":""},{"$f":"IFERROR(VLOOKUP(AY16,AE16:$AF$58,2,FALSE),\"\")","v":""}]
["V5004T1","V5004TY10326000","Si",1800,2340,6000,5100,{"$f":"I17&\":\"&COUNTIF($I$5:I17,I17)","v":"3720:1"},3720,32,6,"Rotary","R",13,"","","",{"$f":"IFERROR(SMALL($Q$5:$Q$38,ROWS(Q$5:$Q17)),\"\")","v":""},{"$f":"IFERROR(INDEX($B$5:$N$38,$R17,COLUMNS($B$5:B17)),\"\")","v":""},null,null,null,null,null,"","","",null,"V5004T1","Térmico NC","MT8-024-NC",8,"Cierra","24Vac/dc",1,"2Pt, 3Pt","B","no",360,16,"",{"$f":"IFERROR(SMALL($AO$2:$AO$58,ROWS($AO$2:AO17)),\"\")","v":""},"",null,{"$f":"IFERROR(INDEX($AE$2:$AK$58,$AP17,COLUMNS($AR$2:AR17)),\"\")","v":""},{"$f":"IFERROR(SMALL($AO$2:$AO$58,ROWS($AO$2:AS17)),\"\")","v":""},"","",{"$f":"IFERROR(SMALL($AV$2:$AV$58,ROWS($F$4:F19)),\"\")","v":""},null,{"$f":"IFERROR(INDEX($AE$2:$AM$58,$AW17,COLUMNS($AX$2:AX17)),\"\")","v":""},{"$f":"IFERROR(VLOOKUP(AY17,AE17:$AF$58,2,FALSE),\"\")","v":""}]
["V5004T2","V5004TY10409000","Si",2700,3510,9000,7650,{"$f":"I18&\":\"&COUNTIF($I$5:I18,I18)","v":"5580:1"},5580,40,"90°","Rotary","R",14,"","","",{"$f":"IFERROR(SMALL($Q$5:$Q$38,ROWS(Q$5:$Q18)),\"\")","v":""},{"$f":"IFERROR(INDEX($B$5:$N$38,$R18,COLUMNS($B$5:B18)),\"\")","v":""},null,null,null,null,null,"","","",null,"V5004T2","Térmico NC","MT8-024-NC-2.5M",8,"Cierra","24Vac/dc",2.5,"2Pt, 3Pt","B","no",360,17,"",{"$f":"IFERROR(SMALL($AO$2:$AO$58,ROWS($AO$2:AO18)),\"\")","v":""},"",null,{"$f":"IFERROR(INDEX($AE$2:$AK$58,$AP18,COLUMNS($AR$2:AR18)),\"\")","v":""},{"$f":"IFERROR(SMALL($AO$2:$AO$58,ROWS($AO$2:AS18)),\"\")","v":""},"","",{"$f":"IFERROR(SMALL($AV$2:$AV$58,ROWS($F$4:F20)),\"\")","v":""},null,{"$f":"IFERROR(INDEX($AE$2:$AM$58,$AW18,COLUMNS($AX$2:AX18)),\"\")","v":""},{"$f":"IFERROR(VLOOKUP(AY18,AE18:$AF$58,2,FALSE),\"\")","v":""}]
["V5004T2","V5004TY10501200","Si",3300,4290,11000,9350,{"$f":"I19&\":\"&COUNTIF($I$5:I19,I19)","v":"6820:1"},6820,50,"90°","Rotary","R",15,"","","",{"$f":"IFERROR(SMALL($Q$5:$Q$38,ROWS(Q$5:$Q19)),\"\")","v":""},{"$f":"IFERROR(INDEX($B$5:$N$38,$R19,COLUMNS($B$5:B19)),\"\")","v":""},null,null,null,null,{"$f":"IFERROR(VLOOKUP(U19,B22:C55,2,FALSE),\"\")","v":""},"","","",null,"V5004T2","Térmico NC","MT8-024S-NC",8,"Cierra","24Vac/dc",1,"2Pt, 3Pt","B",1,360,18,"",{"$f":"IFERROR(SMALL($AO$2:$AO$58,ROWS($AO$2:AO19)),\"\")","v":""},"",null,{"$f":"IFERROR(INDEX($AE$2:$AK$58,$AP19,COLUMNS($AR$2:AR19)),\"\")","v":""},{"$f":"IFERROR(SMALL($AO$2:$AO$58,ROWS($AO$2:AS19)),\"\")","v":""},"","",{"$f":"IFERROR(SMALL($AV$2:$AV$58,ROWS($F$4:F21)),\"\")","v":""},null,{"$f":"IFERROR(INDEX($AE$2:$AM$58,$AW19,COLUMNS($AX$2:AX19)),\"\")","v":""},{"$f":"IFERROR(VLOOKUP(AY19,AE19:$AF$58,2,FALSE),\"\")","v":""}]
["V5004T2","V5004TY10501700","Si",5400,7020,18000,15300,{"$f":"I20&\":\"&COUNTIF($I$5:I20,I20)","v":"11160:1"},11160,50,"90°","Rotary","R",16,"","","",{"$f":"IFERROR(SMALL($Q$5:$Q$38,ROWS(Q$5:$Q20)),\"\")","v":""},{"$f":"IFERROR(INDEX($B$5:$N$38,$R20,COLUMNS($B$5:B20)),\"\")","v":""},null,null,null,null,null,"","","",null,"V5004T2","Térmico NO","MT8-230-NO",8,"Abre","230Vac",1,"2Pt, 3Pt","B","no",390,19,"",{"$f":"IFERROR(SMALL($AO$2:$AO$58,ROWS($AO$2:AO20)),\"\")","v":""},"",null,{"$f":"IFERROR(INDEX($AE$2:$AK$58,$AP20,COLUMNS($AR$2:AR20)),\"\")","v":""},{"$f":"IFERROR(SMALL($AO$2:$AO$58,ROWS($AO$2:AS20)),\"\")","v":""},"",null,{"$f":"IFERROR(SMALL($AV$2:$AV$58,ROWS($F$4:F22)),\"\")","v":""},null,{"$f":"IFERROR(INDEX($AE$2:$AM$58,$AW20,COLUMNS($AX$2:AX20)),\"\")","v":""},{"$f":"IFERROR(VLOOKUP(AY20,AE20:$AF$58,2,FALSE),\"\")","v":""}]
["V5004TF","V5004TF1050","Si",2000,2600,20000,17000,{"$f":"I21&\":\"&COUNTIF($I$5:I21,I21)","v":"9800:1"},9800,50,"-","Included","I",17,"","","",{"$f":"IFERROR(SMALL($Q$5:$Q$38,ROWS(Q$5:$Q21)),\"\")","v":""},{"$f":"IFERROR(INDEX($B$5:$N$38,$R21,COLUMNS($B$5:B21)),\"\")","v":""},null,null,null,null,null,"","","",null,"V5004TF","Térmico NO","MT8-230-NO-2.5M",8,"Abre","230Vac",2.5,"2Pt, 3Pt","B","no",390,20,"",{"$f":"IFERROR(SMALL($AO$2:$AO$58,ROWS($AO$2:AO21)),\"\")","v":""},"",null,{"$f":"IFERROR(INDEX($AE$2:$AK$58,$AP21,COLUMNS($AR$2:AR21)),\"\")","v":""},{"$f":"IFERROR(SMALL($AO$2:$AO$58,ROWS($AO$2:AS21)),\"\")","v":""},"",null,{"$f":"IFERROR(SMALL($AV$2:$AV$58,ROWS($F$4:F23)),\"\")","v":""},null,{"$f":"IFERROR(INDEX($AE$2:$AM$58,$AW21,COLUMNS($AX$2:AX21)),\"\")","v":""},{"$f":"IFERROR(VLOOKUP(AY21,AE21:$AF$58,2,FALSE),\"\")","v":""}]
["V5004TF","V5004TF1065","Si",3000,3900,30000,25500,{"$f":"I22&\":\"&COUNTIF($I$5:I22,I22)","v":"14700:1"},14700,65,"-","Included","I",18,"","","",{"$f":"IFERROR(SMALL($Q$5:$Q$38,ROWS(Q$5:$Q22)),\"\")","v":""},{"$f":"IFERROR(INDEX($B$5:$N$38,$R22,COLUMNS($B$5:B22)),\"\")","v":""},null,null,null,null,null,"","","",null,"V5004TF","Térmico NO","MT8-230S-NO",8,"Abre","230Vac",1,"2Pt, 3Pt","B",1,390,21,"",{"$f":"IFERROR(SMALL($AO$2:$AO$58,ROWS($AO$2:AO22)),\"\")","v":""},"",null,{"$f":"IFERROR(INDEX($AE$2:$AK$58,$AP22,COLUMNS($AR$2:AR22)),\"\")","v":""},{"$f":"IFERROR(SMALL($AO$2:$AO$58,ROWS($AO$2:AS22)),\"\")","v":""},"",null,{"$f":"IFERROR(SMALL($AV$2:$AV$58,ROWS($F$4:F24)),\"\")","v":""},null,{"$f":"IFERROR(INDEX($AE$2:$AM$58,$AW22,COLUMNS($AX$2:AX22)),\"\")","v":""},{"$f":"IFERROR(VLOOKUP(AY22,AE22:$AF$58,2,FALSE),\"\")","v":""}]
["V5004TF","V5004TF1080","Si",3000,3900,30000,25500,{"$f":"I23&\":\"&COUNTIF($I$5:I23,I23)","v":"14700:2"},14700,80,"-","Included","I",19,"","","",{"$f":"IFERROR(SMALL($Q$5:$Q$38,ROWS(Q$5:$Q23)),\"\")","v":""},{"$f":"IFERROR(INDEX($B$5:$N$38,$R23,COLUMNS($B$5:B23)),\"\")","v":""},null,null,null,null,null,"","","",null,"V5004TF","Térmico NC","MT8-230-NC",8,"Cierra","230Vac",1,"2Pt, 3Pt","B","no",390,22,"",{"$f":"IFERROR(SMALL($AO$2:$AO$58,ROWS($AO$2:AO23)),\"\")","v":""},"",null,{"$f":"IFERROR(INDEX($AE$2:$AK$58,$AP23,COLUMNS($AR$2:AR23)),\"\")","v":""},{"$f":"IFERROR(SMALL($AO$2:$AO$58,ROWS($AO$2:AS23)),\"\")","v":""},"",null,{"$f":"IFERROR(SMALL($AV$2:$AV$58,ROWS($F$4:F25)),\"\")","v":""},null,{"$f":"IFERROR(INDEX($AE$2:$AM$58,$AW23,COLUMNS($AX$2:AX23)),\"\")","v":""},{"$f":"IFERROR(VLOOKUP(AY23,AE23:$AF$58,2,FALSE),\"\")","v":""}]
["V5004TF","V5004TF1100","Si",5500,7150,55000,46750,{"$f":"I24&\":\"&COUNTIF($I$5:I24,I24)","v":"26950:1"},26950,100,"-","Included","I",20,"","","",{"$f":"IFERROR(SMALL($Q$5:$Q$38,ROWS(Q$5:$Q24)),\"\")","v":""},{"$f":"IFERROR(INDEX($B$5:$N$38,$R24,COLUMNS($B$5:B24)),\"\")","v":""},null,null,null,null,null,null,null,null,null,"V5004TF","Térmico NC","MT8-230-NC-2.5M",8,"Cierra","230Vac",2.5,"2Pt, 3Pt","B","no",390,23,"",{"$f":"IFERROR(SMALL($AO$2:$AO$58,ROWS($AO$2:AO24)),\"\")","v":""},"",null,{"$f":"IFERROR(INDEX($AE$2:$AK$58,$AP24,COLUMNS($AR$2:AR24)),\"\")","v":""},{"$f":"IFERROR(SMALL($AO$2:$AO$58,ROWS($AO$2:AS24)),\"\")","v":""},"",null,{"$f":"IFERROR(SMALL($AV$2:$AV$58,ROWS($F$4:F26)),\"\")","v":""},null,{"$f":"IFERROR(INDEX($AE$2:$AM$58,$AW24,COLUMNS($AX$2:AX24)),\"\")","v":""},{"$f":"IFERROR(VLOOKUP(AY24,AE24:$AF$58,2,FALSE),\"\")","v":""}]
["V5004TF","V5004TF1125","Si",9000,11700,90000,76500,{"$f":"I25&\":\"&COUNTIF($I$5:I25,I25)","v":"44100:1"},44100,125,"-","Included","I",21,"","","",{"$f":"IFERROR(SMALL($Q$5:$Q$38,ROWS(Q$5:$Q25)),\"\")","v":""},{"$f":"IFERROR(INDEX($B$5:$N$38,$R25,COLUMNS($B$5:B25)),\"\")","v":""},null,null,null,null,null,null,null,null,null,"V5004TF","Térmico NC","MT8-230S-NC",8,"Cierra","230Vac",1,"2Pt, 3Pt","B",1,390,24,"",{"$f":"IFERROR(SMALL($AO$2:$AO$58,ROWS($AO$2:AO25)),\"\")","v":""},"",null,{"$f":"IFERROR(INDEX($AE$2:$AK$58,$AP25,COLUMNS($AR$2:AR25)),\"\")","v":""},{"$f":"IFERROR(SMALL($AO$2:$AO$58,ROWS($AO$2:AS25)),\"\")","v":""},"",null,{"$f":"IFERROR(SMALL($AV$2:$AV$58,ROWS($F$4:F27)),\"\")","v":""},null,{"$f":"IFERROR(INDEX($AE$2:$AM$58,$AW25,COLUMNS($AX$2:AX25)),\"\")","v":""},{"$f":"IFERROR(VLOOKUP(AY25,AE25:$AF$58,2,FALSE),\"\")","v":""}]
["V5004TF","V5004TF1150","Si",15000,19500,150000,127500,{"$f":"I26&\":\"&COUNTIF($I$5:I26,I26)","v":"73500:1"},73500,150,"-","Included","I",22,"","","",{"$f":"IFERROR(SMALL($Q$5:$Q$38,ROWS(Q$5:$Q26)),\"\")","v":""},{"$f":"IFERROR(INDEX($B$5:$N$38,$R26,COLUMNS($B$5:B26)),\"\")","v":""},null,null,null,null,null,null,null,null,null,"V5004TF",null,null,null,null,null,null,null,null,null,null,25,"",{"$f":"IFERROR(SMALL($AO$2:$AO$58,ROWS($AO$2:AO26)),\"\")","v":""},"",null,{"$f":"IFERROR(INDEX($AE$2:$AK$58,$AP26,COLUMNS($AR$2:AR26)),\"\")","v":""},{"$f":"IFERROR(SMALL($AO$2:$AO$58,ROWS($AO$2:AS26)),\"\")","v":""},"",null,{"$f":"IFERROR(SMALL($AV$2:$AV$58,ROWS($F$4:F28)),\"\")","v":""},null,null,{"$f":"IFERROR(VLOOKUP(AY26,AE26:$AF$58,2,FALSE),\"\")","v":""}]
["V5005T1","V5005TY10150350","Si",20,26,350,297.5,{"$f":"I27&\":\"&COUNTIF($I$5:I27,I27)","v":"161.75:1"},161.75,15,2.5,"Linear","A",23,"","","",{"$f":"IFERROR(SMALL($Q$5:$Q$38,ROWS(Q$5:$Q27)),\"\")","v":""},{"$f":"IFERROR(INDEX($B$5:$N$38,$R27,COLUMNS($B$5:B27)),\"\")","v":""},null,null,null,null,null,null,null,null,null,"V5005T1",null,null,null,null,null,null,null,null,null,null,null,null,null,null,null,null,null,"",null,{"$f":"IFERROR(SMALL($AV$2:$AV$58,ROWS($F$4:F29)),\"\")","v":""},null,null,{"$f":"IFERROR(VLOOKUP(AY27,AE27:$AF$58,2,FALSE),\"\")","v":""}]
["V5005T1","V5005TY10151000","Si",100,130,1000,850,{"$f":"I28&\":\"&COUNTIF($I$5:I28,I28)","v":"490:2"},490,15,2.5,"Linear","A",24,"","","",{"$f":"IFERROR(SMALL($Q$5:$Q$38,ROWS(Q$5:$Q28)),\"\")","v":""},{"$f":"IFERROR(INDEX($B$5:$N$38,$R28,COLUMNS($B$5:B28)),\"\")","v":""},null,null,null,null,null,null,null,null,null,"V5005T1",null,null,null,null,null,null,null,null,null,null,null,null,null,null,null,null,null,"",null,{"$f":"IFERROR(SMALL($AV$2:$AV$58,ROWS($F$4:F30)),\"\")","v":""},null,null,{"$f":"IFERROR(VLOOKUP(AY28,AE28:$AF$58,2,FALSE),\"\")","v":""}]
["V5005T1","V5005TY10201000","Si",100,130,1000,850,{"$f":"I29&\":\"&COUNTIF($I$5:I29,I29)","v":"490:3"},490,20,2.5,"Linear","A",25,"","","",{"$f":"IFERROR(SMALL($Q$5:$Q$38,ROWS(Q$5:$Q29)),\"\")","v":""},{"$f":"IFERROR(INDEX($B$5:$N$38,$R29,COLUMNS($B$5:B29)),\"\")","v":""},null,null,null,null,null,null,null,null,null,"V5005T1",null,null,null,null,null,null,null,null,null,null,null,null,null,null,null,null,null,"",null,{"$f":"IFERROR(SMALL($AV$2:$AV$58,ROWS($F$4:F31)),\"\")","v":""},null,null,{"$f":"IFERROR(VLOOKUP(AY29,AE29:$AF$58,2,FALSE),\"\")","v":""}]
["V5005T1","V5005TY10201500","Si",200,260,1500,1275,{"$f":"I30&\":\"&COUNTIF($I$5:I30,I30)","v":"767.5:1"},767.5,20,2.5,"Linear","A",26,"","","",{"$f":"IFERROR(SMALL($Q$5:$Q$38,ROWS(Q$5:$Q30)),\"\")","v":""},{"$f":"IFERROR(INDEX($B$5:$N$38,$R30,COLUMNS($B$5:B30)),\"\")","v":""},null,null,null,null,null,null,null,null,null,"V5005T1",null,null,null,null,null,null,null,null,null,null,null,null,null,null,null,null,null,"",null,{"$f":"IFERROR(SMALL($AV$2:$AV$58,ROWS($F$4:F32)),\"\")","v":""},null,null,{"$f":"IFERROR(VLOOKUP(AY30,AE30:$AF$58,2,FALSE),\"\")","v":""}]
["V5005T1","V5005TY10251000","Si",100,130,1000,850,{"$f":"I31&\":\"&COUNTIF($I$5:I31,I31)","v":"490:4"},490,25,2.5,"Linear","A",27,"","","",{"$f":"IFERROR(SMALL($Q$5:$Q$38,ROWS(Q$5:$Q31)),\"\")","v":""},{"$f":"IFERROR(INDEX($B$5:$N$38,$R31,COLUMNS($B$5:B31)),\"\")","v":""},null,null,null,null,null,null,null,null,null,"V5005T1",null,null,null,null,null,null,null,null,null,null,null,null,null,null,null,null,null,"",null,{"$f":"IFERROR(SMALL($AV$2:$AV$58,ROWS($F$4:F33)),\"\")","v":""},null,null,{"$f":"IFERROR(VLOOKUP(AY31,AE31:$AF$58,2,FALSE),\"\")","v":""}]
["V5005T1","V5005TY10251500","Si",200,260,1500,1275,{"$f":"I32&\":\"&COUNTIF($I$5:I32,I32)","v":"767.5:2"},767.5,25,2.5,"Linear","A",28,"","","",{"$f":"IFERROR(SMALL($Q$5:$Q$38,ROWS(Q$5:$Q32)),\"\")","v":""},{"$f":"IFERROR(INDEX($B$5:$N$38,$R32,COLUMNS($B$5:B32)),\"\")","v":""},null,null,null,null,null,null,null,null,null,"V5005T1",null,null,null,null,null,null,null,null,null,null,null,null,null,null,null,null,null,{"$f":"IFERROR(VLOOKUP(AS32,$AE$2:$AJ$58,6,FALSE),\"\")","v":""},null,{"$f":"IFERROR(SMALL($AV$2:$AV$58,ROWS($F$4:F34)),\"\")","v":""},null,null,{"$f":"IFERROR(VLOOKUP(AY32,AE32:$AF$58,2,FALSE),\"\")","v":""}]
["V5005T2","V5005TY20150350","No",20,26,350,297.5,{"$f":"I33&\":\"&COUNTIF($I$5:I33,I33)","v":"161.75:2"},161.75,15,2.5,"Linear","A",29,"","","",{"$f":"IFERROR(SMALL($Q$5:$Q$38,ROWS(Q$5:$Q33)),\"\")","v":""},{"$f":"IFERROR(INDEX($B$5:$N$38,$R33,COLUMNS($B$5:B33)),\"\")","v":""},null,null,null,null,null,null,null,null,null,"V5005T2",null,null,null,null,null,null,null,null,null,null,null,null,null,null,null,null,null,"",null,{"$f":"IFERROR(SMALL($AV$2:$AV$58,ROWS($F$4:F35)),\"\")","v":""},null,null,{"$f":"IFERROR(VLOOKUP(AY33,AE33:$AF$58,2,FALSE),\"\")","v":""}]
["V5005T2","V5005TY20151000","No",100,130,1000,850,{"$f":"I34&\":\"&COUNTIF($I$5:I34,I34)","v":"490:5"},490,15,2.5,"Linear","A",30,"","","",{"$f":"IFERROR(SMALL($Q$5:$Q$38,ROWS(Q$5:$Q34)),\"\")","v":""},{"$f":"IFERROR(INDEX($B$5:$N$38,$R34,COLUMNS($B$5:B34)),\"\")","v":""},null,null,null,null,null,null,null,null,null,"V5005T2","accion rápido","M5410C1001",6.5,"Paro","24Vac/dc","-","2Pt, 3Pt","B",1.5,"3.6&16",33,"",{"$f":"IFERROR(SMALL($AO$2:$AO$58,ROWS($AO$2:AO34)),\"\")","v":""},{"$f":"IFERROR(VLOOKUP(AS34,$AE$2:$AK$58,6,FALSE),\"\")","v":""},null,{"$f":"IFERROR(INDEX($AE$2:$AK$58,$AP34,COLUMNS($AR$2:AR34)),\"\")","v":""},{"$f":"IFERROR(SMALL($AO$2:$AO$58,ROWS($AO$2:AS34)),\"\")","v":""},"",null,{"$f":"IFERROR(SMALL($AV$2:$AV$58,ROWS($F$4:F36)),\"\")","v":""},null,null,{"$f":"IFERROR(VLOOKUP(AY34,AE34:$AF$58,2,FALSE),\"\")","v":""}]
["V5005T2","V5005TY20201000","No",100,130,1000,850,{"$f":"I35&\":\"&COUNTIF($I$5:I35,I35)","v":"490:6"},490,20,2.5,"Linear","A",31,"","","",{"$f":"IFERROR(SMALL($Q$5:$Q$38,ROWS(Q$5:$Q35)),\"\")","v":""},{"$f":"IFERROR(INDEX($B$5:$N$38,$R35,COLUMNS($B$5:B35)),\"\")","v":""},null,null,null,null,null,null,null,null,null,"V5005T2","accion rápido","M5410L1001",6.5,"Paro","230Vac","-","2Pt, 3Pt","B",1.5,"3.6&16",34,"",{"$f":"IFERROR(SMALL($AO$2:$AO$58,ROWS($AO$2:AO35)),\"\")","v":""},"",null,{"$f":"IFERROR(INDEX($AE$2:$AK$58,$AP35,COLUMNS($AR$2:AR35)),\"\")","v":""},{"$f":"IFERROR(SMALL($AO$2:$AO$58,ROWS($AO$2:AS35)),\"\")","v":""},"",null,{"$f":"IFERROR(SMALL($AV$2:$AV$58,ROWS($F$4:F37)),\"\")","v":""},null,null,{"$f":"IFERROR(VLOOKUP(AY35,AE35:$AF$58,2,FALSE),\"\")","v":""}]
["V5005T2","V5005TY20201500","No",200,260,1500,1275,{"$f":"I36&\":\"&COUNTIF($I$5:I36,I36)","v":"767.5:3"},767.5,20,2.5,"Linear","A",32,"","","",{"$f":"IFERROR(SMALL($Q$5:$Q$38,ROWS(Q$5:$Q36)),\"\")","v":""},{"$f":"IFERROR(INDEX($B$5:$N$38,$R36,COLUMNS($B$5:B36)),\"\")","v":""},null,null,null,null,null,null,null,null,null,"V5005T2","Motor","M7410A1001",4,"Paro","24Vac",0.9,"2Pt, 3Pt","A","no",57,35,"",{"$f":"IFERROR(SMALL($AO$2:$AO$58,ROWS($AO$2:AO36)),\"\")","v":""},"",null,{"$f":"IFERROR(INDEX($AE$2:$AK$58,$AP36,COLUMNS($AR$2:AR36)),\"\")","v":""},{"$f":"IFERROR(SMALL($AO$2:$AO$58,ROWS($AO$2:AS36)),\"\")","v":""},"",null,{"$f":"IFERROR(SMALL($AV$2:$AV$58,ROWS($F$4:F38)),\"\")","v":""}]
["V5005T2","V5005TY20251000","No",100,130,1000,850,{"$f":"I37&\":\"&COUNTIF($I$5:I37,I37)","v":"490:7"},490,25,2.5,"Linear","A",33,"","","",{"$f":"IFERROR(SMALL($Q$5:$Q$38,ROWS(Q$5:$Q37)),\"\")","v":""},{"$f":"IFERROR(INDEX($B$5:$N$38,$R37,COLUMNS($B$5:B37)),\"\")","v":""},null,null,null,null,null,null,null,null,null,"V5005T2","Motor","M7410A1001-3M",4,"Paro","24Vac",3,"2Pt, 3Pt","A","no",57,36,"",{"$f":"IFERROR(SMALL($AO$2:$AO$58,ROWS($AO$2:AO37)),\"\")","v":""},"",null,{"$f":"IFERROR(INDEX($AE$2:$AK$58,$AP37,COLUMNS($AR$2:AR37)),\"\")","v":""},{"$f":"IFERROR(SMALL($AO$2:$AO$58,ROWS($AO$2:AS37)),\"\")","v":""},"",null,{"$f":"IFERROR(SMALL($AV$2:$AV$58,ROWS($F$4:F39)),\"\")","v":""}]
["V5005T2","V5005TY20251500","No",200,260,1500,1275,{"$f":"I38&\":\"&COUNTIF($I$5:I38,I38)","v":"767.5:4"},767.5,25,2.5,"Linear","A",34,"","","",{"$f":"IFERROR(SMALL($Q$5:$Q$38,ROWS(Q$5:$Q38)),\"\")","v":""},{"$f":"IFERROR(INDEX($B$5:$N$38,$R38,COLUMNS($B$5:B38)),\"\")","v":""},null,null,null,null,null,null,null,null,null,"V5005T2","Motor","M7410A1001-5M",4,"Paro","24Vac",5,"2Pt, 3Pt","A","no",57,37,"",{"$f":"IFERROR(SMALL($AO$2:$AO$58,ROWS($AO$2:AO38)),\"\")","v":""},"",null,{"$f":"IFERROR(INDEX($AE$2:$AK$58,$AP38,COLUMNS($AR$2:AR38)),\"\")","v":""},{"$f":"IFERROR(SMALL($AO$2:$AO$58,ROWS($AO$2:AS38)),\"\")","v":""},"",null,{"$f":"IFERROR(SMALL($AV$2:$AV$58,ROWS($F$4:F40)),\"\")","v":""}]
[null,null,null,null,null,null,null,null,null,null,null,null,{"$f":"IF(K39=2.9,\"A\",IF(K39=6,\"B\",IF(K39=2.5,\"A\",\"\")))","v":""},null,null,null,null,null,"None","----",null,null,null,null,null,null,null,null,null,"Motor","M7410A1001-10M",4,"Paro","24Vac",10,"2Pt, 3Pt","A","no",57,38,"",{"$f":"IFERROR(SMALL($AO$2:$AO$58,ROWS($AO$2:AO39)),\"\")","v":""},"",null,{"$f":"IFERROR(INDEX($AE$2:$AK$58,$AP39,COLUMNS($AR$2:AR39)),\"\")","v":""},{"$f":"IFERROR(SMALL($AO$2:$AO$58,ROWS($AO$2:AS39)),\"\")","v":""},"",null,{"$f":"IFERROR(SMALL($AV$2:$AV$58,ROWS($F$4:F41)),\"\")","v":""}]
[null,null,null,null,null,null,null,null,null,null,null,null,"",null,null,null,null,null,"Therm NC","2Pt, 3Pt",null,null,null,null,null,null,null,null,null,"Motor","M7410C1007",6.5,"Paro","24Vac",0.9,"2Pt, 3Pt","B","no",150,39,"",{"$f":"IFERROR(SMALL($AO$2:$AO$58,ROWS($AO$2:AO40)),\"\")","v":""},"",null,{"$f":"IFERROR(INDEX($AE$2:$AK$58,$AP40,COLUMNS($AR$2:AR40)),\"\")","v":""},{"$f":"IFERROR(SMALL($AO$2:$AO$58,ROWS($AO$2:AS40)),\"\")","v":""},"",null,{"$f":"IFERROR(SMALL($AV$2:$AV$58,ROWS($F$4:F42)),\"\")","v":""}]
[null,null,null,null,null,null,null,null,null,null,null,null,"",null,null,null,null,null,"Therm NO","0…10V",null,null,null,null,null,null,null,null,null,"Motor","M7410C1007-3M",6.5,"Paro","24Vac",3,"2Pt, 3Pt","B","no",150,40,"",{"$f":"IFERROR(SMALL($AO$2:$AO$58,ROWS($AO$2:AO41)),\"\")","v":""},"",null,{"$f":"IFERROR(INDEX($AE$2:$AK$58,$AP41,COLUMNS($AR$2:AR41)),\"\")","v":""},{"$f":"IFERROR(SMALL($AO$2:$AO$58,ROWS($AO$2:AS41)),\"\")","v":""},"",null,{"$f":"IFERROR(SMALL($AV$2:$AV$58,ROWS($F$4:F43)),\"\")","v":""}]
[null,null,null,null,null,null,null,null,null,null,null,null,"",null,null,null,null,null,"Motor",null,null,null,null,null,null,null,null,null,null,"Motor","M7410C1007-5M",6.5,"Paro","24Vac",5,"2Pt, 3Pt","B","no",150,41,"",{"$f":"IFERROR(SMALL($AO$2:$AO$58,ROWS($AO$2:AO42)),\"\")","v":""},"",null,{"$f":"IFERROR(INDEX($AE$2:$AK$58,$AP42,COLUMNS($AR$2:AR42)),\"\")","v":""},{"$f":"IFERROR(SMALL($AO$2:$AO$58,ROWS($AO$2:AS42)),\"\")","v":""},"",null,{"$f":"IFERROR(SMALL($AV$2:$AV$58,ROWS($F$4:F44)),\"\")","v":""}]
[null,null,null,null,null,null,null,null,null,null,null,null,"",null,null,null,null,null,"Fast run",null,null,null,null,null,null,null,null,null,null,"Motor","M7410C1007-10M",6.5,"Paro","24Vac",10,"2Pt, 3Pt","B","no",150,42,"",{"$f":"IFERROR(SMALL($AO$2:$AO$58,ROWS($AO$2:AO43)),\"\")","v":""},"",null,{"$f":"IFERROR(INDEX($AE$2:$AK$58,$AP43,COLUMNS($AR$2:AR43)),\"\")","v":""},{"$f":"IFERROR(SMALL($AO$2:$AO$58,ROWS($AO$2:AS43)),\"\")","v":""},"",null,{"$f":"IFERROR(SMALL($AV$2:$AV$58,ROWS($F$4:F45)),\"\")","v":""}]
[null,null,null,null,null,null,null,null,null,null,null,null,"",null,null,null,null,null,"Rotary",null,null,null,null,null,null,null,null,null,null,"Motor","M6410C2023",6.5,"Paro","24Vac",1.5,"2Pt, 3Pt","B","no",150,43,"",{"$f":"IFERROR(SMALL($AO$2:$AO$58,ROWS($AO$2:AO44)),\"\")","v":""},"",null,{"$f":"IFERROR(INDEX($AE$2:$AK$58,$AP44,COLUMNS($AR$2:AR44)),\"\")","v":""},{"$f":"IFERROR(SMALL($AO$2:$AO$58,ROWS($AO$2:AS44)),\"\")","v":""},"",null,{"$f":"IFERROR(SMALL($AV$2:$AV$58,ROWS($F$4:F46)),\"\")","v":""}]
[null,null,null,null,null,null,null,null,null,null,null,null,"",null,null,null,null,null,null,null,null,null,null,null,null,null,null,null,null,"Motor","M6410C4029",6.5,"Paro","24Vac",1.5,"2Pt, 3Pt","B",2,150,44,"",{"$f":"IFERROR(SMALL($AO$2:$AO$58,ROWS($AO$2:AO45)),\"\")","v":""},"",null,{"$f":"IFERROR(INDEX($AE$2:$AK$58,$AP45,COLUMNS($AR$2:AR45)),\"\")","v":""},{"$f":"IFERROR(SMALL($AO$2:$AO$58,ROWS($AO$2:AS45)),\"\")","v":""},"",null,{"$f":"IFERROR(SMALL($AV$2:$AV$58,ROWS($F$4:F47)),\"\")","v":""}]
[null,null,null,null,null,null,null,null,null,null,null,null,"",null,null,null,null,null,null,null,null,null,null,null,null,null,null,null,null,"Motor","M6410L2023",6.5,"Paro","230Vac",1.5,"2Pt, 3Pt","B","no",150,45,"",{"$f":"IFERROR(SMALL($AO$2:$AO$58,ROWS($AO$2:AO46)),\"\")","v":""},"",null,{"$f":"IFERROR(INDEX($AE$2:$AK$58,$AP46,COLUMNS($AR$2:AR46)),\"\")","v":""},{"$f":"IFERROR(SMALL($AO$2:$AO$58,ROWS($AO$2:AS46)),\"\")","v":""},"",null,{"$f":"IFERROR(SMALL($AV$2:$AV$58,ROWS($F$4:F48)),\"\")","v":""}]
[null,null,null,null,null,null,null,null,null,null,null,null,"",null,null,null,null,null,null,null,null,null,null,null,null,null,null,null,null,"Motor","M6410L4029",6.5,"Paro","230Vac",1.5,"2Pt, 3Pt","B",2,150,46,"",{"$f":"IFERROR(SMALL($AO$2:$AO$58,ROWS($AO$2:AO47)),\"\")","v":""},"",null,{"$f":"IFERROR(INDEX($AE$2:$AK$58,$AP47,COLUMNS($AR$2:AR47)),\"\")","v":""},{"$f":"IFERROR(SMALL($AO$2:$AO$58,ROWS($AO$2:AS47)),\"\")","v":""},"",null,{"$f":"IFERROR(SMALL($AV$2:$AV$58,ROWS($F$4:F49)),\"\")","v":""}]
[null,null,null,null,null,null,null,null,null,null,null,null,"",null,null,null,null,null,null,null,null,null,null,null,null,null,null,null,null,"Motor","M7410E5001",2.9,"Paro","24Vac",1.5,"0…10V","A","no",70,47,"",{"$f":"IFERROR(SMALL($AO$2:$AO$58,ROWS($AO$2:AO48)),\"\")","v":""},"",null,{"$f":"IFERROR(INDEX($AE$2:$AK$58,$AP48,COLUMNS($AR$2:AR48)),\"\")","v":""},{"$f":"IFERROR(SMALL($AO$2:$AO$58,ROWS($AO$2:AS48)),\"\")","v":""},"",null,{"$f":"IFERROR(SMALL($AV$2:$AV$58,ROWS($F$4:F50)),\"\")","v":""}]
[null,null,null,null,null,null,null,null,null,null,null,null,"",null,null,null,null,null,null,null,null,null,null,null,null,null,null,null,null,"Motor","M7410E5001-3M",2.9,"Paro","24Vac",3,"0…10V","A","no",70,48,"",{"$f":"IFERROR(SMALL($AO$2:$AO$58,ROWS($AO$2:AO49)),\"\")","v":""},"",null,{"$f":"IFERROR(INDEX($AE$2:$AK$58,$AP49,COLUMNS($AR$2:AR49)),\"\")","v":""},{"$f":"IFERROR(SMALL($AO$2:$AO$58,ROWS($AO$2:AS49)),\"\")","v":""},"",null,{"$f":"IFERROR(SMALL($AV$2:$AV$58,ROWS($F$4:F51)),\"\")","v":""}]
[null,null,null,null,null,null,null,null,null,null,null,null,"",null,null,null,null,null,null,null,null,null,null,null,null,null,null,null,null,"Motor","M7410E5001-5M",2.9,"Paro","24Vac",5,"0…10V","A","no",70,49,"",{"$f":"IFERROR(SMALL($AO$2:$AO$58,ROWS($AO$2:AO50)),\"\")","v":""},"",null,{"$f":"IFERROR(INDEX($AE$2:$AK$58,$AP50,COLUMNS($AR$2:AR50)),\"\")","v":""},{"$f":"IFERROR(SMALL($AO$2:$AO$58,ROWS($AO$2:AS50)),\"\")","v":""},"",null,{"$f":"IFERROR(SMALL($AV$2:$AV$58,ROWS($F$4:F52)),\"\")","v":""}]
[null,null,null,null,null,null,null,null,null,null,null,null,"",null,null,null,null,null,null,null,null,null,null,null,null,null,null,null,null,"Motor","M7410E5001-10M",2.9,"Paro","24Vac",10,"0…10V","A","no",70,50,"",{"$f":"IFERROR(SMALL($AO$2:$AO$58,ROWS($AO$2:AO51)),\"\")","v":""},"",null,{"$f":"IFERROR(INDEX($AE$2:$AK$58,$AP51,COLUMNS($AR$2:AR51)),\"\")","v":""},{"$f":"IFERROR(SMALL($AO$2:$AO$58,ROWS($AO$2:AS51)),\"\")","v":""},"",null,{"$f":"IFERROR(SMALL($AV$2:$AV$58,ROWS($F$4:F53)),\"\")","v":""}]
[null,null,null,null,null,null,null,null,null,null,null,null,"",null,null,null,null,null,null,null,null,null,null,null,null,null,null,null,null,"Motor","M7410E1002",6.5,"Paro","24Vac",1.5,"0…10V","B","no",150,51,"",{"$f":"IFERROR(SMALL($AO$2:$AO$58,ROWS($AO$2:AO52)),\"\")","v":""},"",null,{"$f":"IFERROR(INDEX($AE$2:$AK$58,$AP52,COLUMNS($AR$2:AR52)),\"\")","v":""},{"$f":"IFERROR(SMALL($AO$2:$AO$58,ROWS($AO$2:AS52)),\"\")","v":""},"",null,{"$f":"IFERROR(SMALL($AV$2:$AV$58,ROWS($F$4:F54)),\"\")","v":""}]
[null,null,null,null,null,null,null,null,null,null,null,null,"",null,null,null,null,null,null,null,null,null,null,null,null,null,null,null,null,"Motor","M7410E1002-10M",6.5,"Paro","24Vac",10,"0…10V","B","no",150,52,"",{"$f":"IFERROR(SMALL($AO$2:$AO$58,ROWS($AO$2:AO53)),\"\")","v":""},"",null,{"$f":"IFERROR(INDEX($AE$2:$AK$58,$AP53,COLUMNS($AR$2:AR53)),\"\")","v":""},{"$f":"IFERROR(SMALL($AO$2:$AO$58,ROWS($AO$2:AS53)),\"\")","v":""},"",null,{"$f":"IFERROR(SMALL($AV$2:$AV$58,ROWS($F$4:F55)),\"\")","v":""}]
[null,null,null,null,null,null,null,null,null,null,null,null,"",null,null,null,null,null,null,null,null,null,null,null,null,null,null,null,null,"Motor","M7410E2026",6.5,"Paro","24Vac",1.5,"0…10V","B","no",150,53,"",{"$f":"IFERROR(SMALL($AO$2:$AO$58,ROWS($AO$2:AO54)),\"\")","v":""},"",null,{"$f":"IFERROR(INDEX($AE$2:$AK$58,$AP54,COLUMNS($AR$2:AR54)),\"\")","v":""},{"$f":"IFERROR(SMALL($AO$2:$AO$58,ROWS($AO$2:AS54)),\"\")","v":""},"",null,{"$f":"IFERROR(SMALL($AV$2:$AV$58,ROWS($F$4:F56)),\"\")","v":""}]
[null,null,null,null,null,null,null,null,null,null,null,null,"",null,null,null,null,null,null,null,null,null,null,null,null,null,null,null,null,"Motor","M7410E4022",6.5,"Paro","24Vac",1.5,"0…10V","B",2,150,54,"",{"$f":"IFERROR(SMALL($AO$2:$AO$58,ROWS($AO$2:AO55)),\"\")","v":""},"",null,{"$f":"IFERROR(INDEX($AE$2:$AK$58,$AP55,COLUMNS($AR$2:AR55)),\"\")","v":""},{"$f":"IFERROR(SMALL($AO$2:$AO$58,ROWS($AO$2:AS55)),\"\")","v":""},"",null,{"$f":"IFERROR(SMALL($AV$2:$AV$58,ROWS($F$4:F57)),\"\")","v":""}]
[null,null,null,null,null,null,null,null,null,null,null,null,"",null,null,null,null,null,null,null,null,null,null,null,null,null,null,null,null,"Motor","M7061E1012","90°","Paro","24Vac/dc","-","0…10V","R","no",90,55,"",{"$f":"IFERROR(SMALL($AO$2:$AO$58,ROWS($AO$2:AO56)),\"\")","v":""},"",null,{"$f":"IFERROR(INDEX($AE$2:$AK$58,$AP56,COLUMNS($AR$2:AR56)),\"\")","v":""},{"$f":"IFERROR(SMALL($AO$2:$AO$58,ROWS($AO$2:AS56)),\"\")","v":""},{"$f":"IFERROR(VLOOKUP(AS56,$AE$2:$AJ$58,6,FALSE),\"\")","v":""},null,{"$f":"IFERROR(SMALL($AV$2:$AV$58,ROWS($F$4:F58)),\"\")","v":""}]
[null,null,null,null,null,null,null,null,null,null,null,null,"",null,null,null,null,null,null,null,null,null,null,null,null,null,null,null,null,"Motor","M6061A1013","90°","Paro","24Vac","-","2Pt, 3Pt","R","no",90,56,"",{"$f":"IFERROR(SMALL($AO$2:$AO$58,ROWS($AO$2:AO57)),\"\")","v":""},"",null,{"$f":"IFERROR(INDEX($AE$2:$AK$58,$AP57,COLUMNS($AR$2:AR57)),\"\")","v":""},{"$f":"IFERROR(SMALL($AO$2:$AO$58,ROWS($AO$2:AS57)),\"\")","v":""},"",null,{"$f":"IFERROR(SMALL($AV$2:$AV$58,ROWS($F$4:F59)),\"\")","v":""}]
[null,null,null,null,null,null,null,null,null,null,null,null,"",null,null,null,null,null,null,null,null,null,null,null,null,null,null,null,null,"Motor","M6061L1019","90°","Paro","230Vac","-","2Pt, 3Pt","R","no",90,57,"",{"$f":"IFERROR(SMALL($AO$2:$AO$58,ROWS($AO$2:AO58)),\"\")","v":""},"",null,{"$f":"IFERROR(INDEX($AE$2:$AK$58,$AP58,COLUMNS($AR$2:AR58)),\"\")","v":""},{"$f":"IFERROR(SMALL($AO$2:$AO$58,ROWS($AO$2:AS58)),\"\")","v":""},"",null,{"$f":"IFERROR(SMALL($AV$2:$AV$58,ROWS($F$4:F60)),\"\")","v":""}]

{"sheet":"Precios","index":2,"n_rows":87,"n_cols":2,"rows_kept":87,"cut":false,"hidden":false,"merged":[]}
["Referencia","Precio €"]
["MT4-024-NO"]
["MT4-024-NO-2.5M"]
["MT4-024S-NO"]
["MT4-024-NC"]
["MT4-024-NC-2.5M"]
["MT4-024S-NC"]
["MT4-230-NO"]
["MT4-230-NO-2.5M"]
["MT4-230S-NO"]
["MT4-230-NC"]
["MT4-230-NC-2.5M"]
["MT4-230S-NC"]
["MT8-024-NO"]
["MT8-024-NO-2.5M"]
["MT8-024S-NO"]
["MT8-024-NC"]
["MT8-024-NC-2.5M"]
["MT8-024S-NC"]
["MT8-230-NO"]
["MT8-230-NO-2.5M"]
["MT8-230S-NO"]
["MT8-230-NC"]
["MT8-230-NC-2.5M"]
["MT8-230S-NC"]
["M5410C1001"]
["M5410L1001"]
["M7410A1001"]
["M7410A1001-3M"]
["M7410A1001-5M"]
["M7410A1001-10M"]
["M7410C1007"]
["M7410C1007-3M"]
["M7410C1007-5M"]
["M7410C1007-10M"]
["M6410C2023"]
["M6410C4029"]
["M6410L2023"]
["M6410L4029"]
["M7410E5001"]
["M7410E5001-3M"]
["M7410E5001-5M"]
["M7410E5001-10M"]
["M7410E1002"]
["M7410E1002-10M"]
["M7410E2026"]
["M7410E4022"]
["M7061E1012"]
["M6061A1013"]
["M6061L1019"]
["V5004TY10150150"]
["V5004TY10150600"]
["V5004TY10150780"]
["V5004TY10201000"]
["V5004TY10201500"]
["V5004TY10251500"]
["V5004TY10202200"]
["V5004TY10202700"]
["V5004TY10252200"]
["V5004TY10252700"]
["V5004TY10322700"]
["V5004TY10323000"]
["V5004TY10326000"]
["V5004TY10409000"]
["V5004TY10501200"]
["V5004TY10501700"]
["V5004TF1050"]
["V5004TF1065"]
["V5004TF1080"]
["V5004TF1100"]
["V5004TF1125"]
["V5004TF1150"]
["V5005TY10150350"]
["V5005TY10151000"]
["V5005TY10201000"]
["V5005TY10201500"]
["V5005TY10251000"]
["V5005TY10251500"]
["V5005TY20150350"]
["V5005TY20151000"]
["V5005TY20201000"]
["V5005TY20201500"]
["V5005TY20251000"]
["V5005TY20251500"]
["VM242A0101"]
["VA3401A008 "]
["VS2600C1"]